program: Gaussian 09
title: 000201476
version: EM64L-G09RevD.01
frameworkgroup: C1[X(C21H23NO)]
method: RPBEPBE
basis: SDD
operation: Freq
keyword: #p
keyword: freq=noraman
keyword: PBEPBE/SDD
title: #p freq=noraman PBEPBE/SDD
converged: YES YES NO NO
title: Mulliken charges:
elementType: O N C C C C C C C C C C C C C C C C C C C C C H H H H H H H H H H H H H H H H H H H H H H H
charge: -0.279200 -0.067744 -0.464034 -0.445828 -0.429498 -0.428592 -0.413453 0.031837 -0.280311 0.467185 0.363882 -0.311807 -0.060681 -0.449193 -0.387179 -0.345198 -0.421657 -0.225978 -0.230312 -0.229390 -0.218177 -0.241137 -0.248071 0.221289 0.229228 0.229389 0.220454 0.221932 0.224076 0.243684 0.224004 0.220009 0.241629 0.206095 0.238502 0.216409 0.235436 0.243610 0.258354 0.283042 0.227330 0.223769 0.227578 0.223440 0.229312 0.225964
chargesum: 0.00000
title: Mulliken charges with hydrogens summed into heavy atoms:
elementType: O N C C C C C C C C C C C C C C C C C C C C C
charge: -0.279200 -0.067744 -0.013516 0.004015 0.016510 0.039096 0.048185 0.031837 -0.074216 0.467185 0.363882 0.143104 -0.060681 -0.213757 -0.143569 -0.086844 -0.138614 0.001352 -0.006542 -0.001812 0.005263 -0.011825 -0.022107
polarizability: 2.83592058e+02 1.95746868e+01 2.41930594e+02 1.04565404e+01 8.95952224e+00 1.70193689e+02
1716.lowfreq: -19.9635 -10.3747 -3.9922 -0.0005 0.0005 0.0007 8.1906 10.2481 13.2355
frequency: -16.7387 -7.6540 12.9275 24.2050 34.2314 35.0063 48.9608 57.9467 68.2608 101.9838 131.2215 147.7643 180.5947 210.8991 224.2205 246.4297 270.5958 288.5147 324.3693 358.9979 371.4257 392.8189 402.2118 404.3455 454.4836 460.2224 502.4504 573.8066 603.7328 615.2483 616.2184 631.9522 638.2858 651.4138 705.0294 706.3015 739.9986 753.5867 769.3452 798.3966 826.8448 829.0965 840.2351 856.0128 860.6996 866.1905 874.1958 903.5826 915.1321 929.4138 932.6245 942.8723 967.5299 978.8963 984.2193 986.5564 989.6774 990.4852 993.4943 998.7374 1000.2770 1009.7186 1025.5715 1028.0262 1041.5092 1066.1814 1080.4614 1084.1722 1103.5752 1169.4917 1170.5191 1172.6398 1179.1587 1180.8926 1185.8392 1185.9269 1189.6570 1200.0814 1212.6419 1217.4227 1236.0363 1243.9152 1268.9235 1281.3852 1284.0368 1298.9168 1307.6364 1316.1998 1317.8911 1335.5616 1350.0863 1368.2667 1382.1219 1386.7524 1434.0212 1442.4141 1454.6783 1463.4236 1464.2930 1469.8575 1474.1332 1480.2368 1481.5786 1488.3602 1591.2501 1594.3504 1610.4994 1614.3565 2288.2444 2851.5063 2896.6632 2922.7861 2976.5974 2994.4220 3000.8051 3002.1730 3006.8274 3018.5841 3054.1952 3069.8455 3079.0603 3091.4247 3110.8914 3119.2114 3126.1073 3127.7098 3137.6687 3140.8069 3149.1940 3157.8185 3164.0170 3177.5988
redmass: 2.7678 3.5169 4.5229 3.6689 2.5050 3.7486 4.0628 4.1558 4.4415 2.6881 4.6877 3.1985 4.7879 4.4063 4.2155 4.0027 3.2164 4.0822 4.9301 3.5946 2.1721 5.3629 2.8359 2.9005 4.7017 3.4353 4.4337 5.3369 4.5839 6.3234 6.2841 2.4312 2.8261 5.0052 2.0787 1.6576 1.8390 2.0498 2.0569 3.1763 3.1916 1.7508 2.4815 1.2568 1.2470 3.0365 3.5540 2.5937 3.4064 1.6129 1.6876 1.8282 1.8359 1.3911 1.4525 2.2268 4.0622 6.2542 3.3859 1.4105 1.3303 2.9948 2.2303 2.1329 2.0899 2.2594 1.5895 1.6056 2.5561 1.2948 1.0645 1.0691 2.3167 1.8506 1.2347 1.1380 1.4105 1.1176 1.7743 1.1590 1.2266 1.3653 1.7232 1.3353 1.3014 1.2225 1.4500 1.2585 1.3044 1.2886 1.4296 1.5432 7.3868 5.5802 2.2191 2.1149 1.0801 1.0830 1.0880 1.0798 1.0852 2.2660 2.3021 1.0929 6.2426 6.1289 6.0530 6.0840 11.7834 1.0698 1.0817 1.0589 1.0988 1.0628 1.0640 1.0624 1.0844 1.0646 1.1010 1.1016 1.1026 1.1049 1.0879 1.0848 1.0859 1.0884 1.0910 1.0940 1.0959 1.0990 1.1014 1.0953
irintensity: 0.6214 0.4508 0.0964 0.1345 0.2282 0.0354 0.2095 0.4883 0.3152 4.6272 2.5966 2.2256 8.8613 2.6236 0.7765 5.2247 1.8366 0.8512 0.8929 0.8208 3.8135 1.9858 0.0668 0.1769 3.8147 4.4175 8.4142 3.3068 12.1879 2.3971 0.0191 4.7631 6.3013 17.5034 40.1951 59.1676 55.5854 23.8296 43.2998 1.3027 7.0021 2.3217 5.2670 0.2341 0.3974 12.3590 14.1483 0.5396 12.5085 27.6589 13.9185 3.7920 2.5655 0.0836 18.2244 72.3368 5.9429 0.8723 136.9947 13.7464 2.1821 10.8506 5.2491 10.9645 15.9504 13.2631 4.9053 9.5608 1.7515 11.1483 0.3138 0.3504 32.3795 0.5969 2.4956 2.1779 3.9379 7.0476 8.0907 2.9080 14.1534 3.1132 11.6981 6.5132 46.0245 1.0656 8.9989 15.2422 2.4176 6.2455 33.7734 44.0044 0.3847 0.6211 14.2940 13.7182 6.2573 2.0418 2.3838 11.4446 9.5012 5.7067 25.3371 10.6778 0.8051 0.3528 3.7721 5.2961 7.8649 59.6365 38.5798 39.7393 23.0559 43.5625 31.7078 58.8074 12.9583 43.5130 17.6726 7.3925 26.4464 87.6708 8.8507 2.1196 0.0049 4.6106 14.9818 34.7942 31.5411 32.9276 25.2777 7.3120
temp: 298.150 k
press: 1.00000 atm
elementType: 8 7 6 6 6 6 6 6 6 6 6 6 6 6 6 6 6 6 6 6 6 6 6 1 1 1 1 1 1 1 1 1 1 1 1 1 1 1 1 1 1 1 1 1 1 1
symmnumber: 1
zpe: 1002674.0 jmol-1
zpe.correction: 0.381898 hartree
zpe.thermalcorrener: 0.401905 hartree
zpe.thermalcorrenthalpy: 0.402849 hartree
zpe.thermalcorrgfe: 0.329256 hartree
zpe.sumelectzpe: -942.239852 hartree
zpe.sumelectthermal: -942.219846 hartree
zpe.sumelectthermalent: -942.218902 hartree
zpe.sumelectthermalfe: -942.292495 hartree
dipole: 0.0677 -0.6104 0.3634
dipole: 0.7136
quadrupole: -116.9366 -128.8210 -132.7786
quadrupole: 8.7556 7.3149 -0.1511
quadrupole: 9.2422 -2.6423 -6.5998 8.7556 7.3149 -0.1511
hfenergy: -942.6217508 hartree
pointgroup: C01 [X(C21H23N1O1)]
dipole: 0.0212017 0.0861871 -0.2663648 debye
polarizability: 283.7200719|-22.3791302|219.6465815|3.1275687|-33.9485204|192.3496875 unknown
InChI: InChI=1S/C21H23NO/c1-3-11-19(12-4-1)21(20-13-5-2-6-14-20)23-18-10-9-17-22-15-7-8-16-22/h1-6,11-14,21H,7-8,15-18H2
charge 0 multiplicity 1
46 atoms
O  -0.395454 0.196699 0.021263
N  5.242626 0.939277 -0.330997
C  6.884606 -0.88057 -0.482401
C  5.875907 -1.225707 0.663473
C  6.646165 0.64549 -0.751945
C  5.078373 0.108568 0.90033
C  4.260398 0.595593 -1.408379
C  2.867505 0.894909 -1.037295
C  -1.76691 0.472788 0.508989
C  -2.659707 1.02434 -0.603605
C  -2.28652 -0.828892 1.128873
C  0.301121 1.430748 -0.407841
C  1.689577 1.116391 -0.746779
C  -3.260925 2.299625 -0.482386
C  -3.663916 -0.957933 1.440172
C  -2.878719 0.266317 -1.782477
C  -1.40428 -1.889459 1.447969
C  -4.079549 2.811909 -1.516437
C  -4.151368 -2.126353 2.065436
C  -3.688646 0.776748 -2.818307
C  -1.895242 -3.062286 2.066372
C  -4.29465 2.050746 -2.687182
C  -3.267811 -3.184934 2.381131
H  7.93144 -1.082286 -0.195491
H  6.670427 -1.477067 -1.387572
H  5.201082 -2.047304 0.364794
H  6.393989 -1.545098 1.584692
H  7.324463 1.247811 -0.118379
H  6.812655 0.94176 -1.802139
H  4.008576 -0.048131 1.11534
H  5.517265 0.664816 1.749557
H  4.307416 -0.479481 -1.718329
H  4.531388 1.192513 -2.300671
H  -1.702508 1.245505 1.312558
H  -0.220282 1.871701 -1.28361
H  0.269559 2.177423 0.417582
H  -3.090196 2.894944 0.424197
H  -4.357147 -0.148227 1.18302
H  -2.405833 -0.717701 -1.877212
H  -0.345053 -1.785762 1.198529
H  -4.542587 3.799392 -1.410357
H  -5.218307 -2.212614 2.300835
H  -3.851549 0.185245 -3.726367
H  -1.204303 -3.879431 2.303899
H  -4.926264 2.444695 -3.491395
H  -3.645718 -4.093718 2.863242
