program: Gaussian 09
title: 000201409
version: EM64L-G09RevD.01
frameworkgroup: C1[X(C16H19NO3)]
method: RPBEPBE
basis: SDD
operation: Freq
keyword: #p
keyword: freq=noraman
keyword: PBEPBE/SDD
title: #p freq=noraman PBEPBE/SDD
converged: YES YES NO NO
title: Mulliken charges:
elementType: O O O N C C C C C C C C C C C C C C C C H H H H H H H H H H H H H H H H H H H
charge: -0.475504 -0.263419 -0.270170 -0.636987 -0.441390 -0.206059 0.580948 0.454527 -0.422892 -0.416589 -0.384452 -0.412792 -0.353541 -0.373498 -0.361287 -0.350221 0.317202 0.317538 -0.537746 -0.538514 0.267119 0.216619 0.295638 0.300404 0.237214 0.225673 0.239460 0.275606 0.374204 0.251909 0.240546 0.247101 0.234989 0.219927 0.221719 0.247073 0.220420 0.217695 0.241532
chargesum: 0.00000
title: Mulliken charges with hydrogens summed into heavy atoms:
elementType: O O O N C C C C C C C C C C C C C C C C
charge: -0.101300 -0.263419 -0.270170 -0.040946 -0.174271 0.010560 0.580948 0.454527 -0.185678 -0.190917 -0.144992 -0.137186 -0.101632 -0.132952 -0.114186 -0.115232 0.317202 0.317538 0.150972 0.141134
polarizability: 2.38670948e+02 -9.97995866e+00 2.03779281e+02 -2.83223413e+01 -1.25505290e+00 1.34141814e+02
1716.lowfreq: -15.8778 -6.8969 -5.0830 -0.0006 -0.0006 -0.0002 14.7159 30.1735 35.8071
frequency: 14.5072 30.1690 35.7518 60.8208 64.8359 97.0227 110.6888 145.0421 158.1182 159.6512 203.7824 231.2280 245.6140 252.9210 261.2019 274.4814 279.1288 323.1488 343.4094 384.9282 412.2163 413.2354 434.4133 455.6464 480.4544 502.3904 530.6229 546.9587 556.6981 566.3083 629.0771 632.9783 719.8387 724.9559 735.5560 749.8529 773.3766 808.9135 817.3090 824.4790 831.8184 836.5891 840.2525 847.4439 922.5536 933.9985 956.2215 962.3596 972.3148 987.3719 989.3954 1001.0417 1002.6653 1020.6795 1060.0572 1104.8560 1109.3152 1111.3111 1111.9986 1131.4918 1155.1363 1155.8697 1170.0599 1177.0938 1198.9323 1204.9038 1224.1313 1231.9023 1236.3532 1277.1701 1293.4614 1309.3699 1311.5580 1350.3962 1383.4642 1387.7793 1408.7008 1414.7250 1419.3902 1435.8125 1436.2417 1464.7377 1466.7083 1471.6710 1473.4446 1500.6211 1501.2802 1581.8290 1585.9346 1621.6423 1623.3172 1639.8048 2909.6605 2954.9113 2959.2395 3025.8385 3040.6053 3046.7528 3106.5936 3119.7965 3126.0038 3127.1635 3127.7979 3133.9308 3146.1244 3156.9839 3163.6635 3167.5340 3168.7597 3434.3219 3556.6173
redmass: 4.7408 3.4884 4.0906 3.8365 4.3212 3.8020 3.9353 4.0245 4.2986 3.6607 1.7369 1.2406 2.0412 3.0969 1.8331 2.8728 1.9472 5.4303 4.7067 5.0288 2.9243 2.9979 4.4264 4.0501 3.8317 4.2099 2.5465 3.4259 3.4780 4.4390 7.0425 6.8405 2.8428 3.0266 3.5692 4.4519 2.7694 1.3876 1.5781 1.4101 1.3761 1.5595 2.4104 2.4686 2.2626 1.5312 1.4320 1.4035 1.3538 8.5021 8.3027 2.6166 2.8571 5.1874 3.6690 1.3789 1.3587 1.2605 1.2617 1.3208 1.3524 1.3467 1.2117 1.2784 1.5402 2.1083 3.8800 2.8521 2.0446 1.3377 1.2791 1.2929 1.2965 1.4334 3.6273 3.8791 1.8847 2.5155 2.7276 1.1707 1.1744 1.0505 1.0502 1.0704 1.0730 2.4684 2.5117 7.0192 7.2125 6.2377 6.4658 1.0903 1.0827 1.0331 1.0331 1.0865 1.1037 1.1039 1.0890 1.0990 1.0992 1.0891 1.0895 1.0629 1.0874 1.0933 1.0949 1.0953 1.0956 1.0463 1.0957
irintensity: 0.2818 2.6269 0.4840 4.0628 1.6592 0.6887 9.8794 2.8896 5.1986 4.4519 0.6994 0.4725 1.1157 1.7655 4.4715 6.2864 3.8405 2.9126 6.8727 3.2840 0.2167 0.1601 4.6279 2.4106 0.2854 2.7793 5.5561 60.9584 12.1357 21.6790 0.3647 1.6230 51.2381 54.8218 4.1691 17.2792 56.6373 19.9301 26.3925 38.6900 54.6048 112.3593 83.4191 34.6474 31.5336 3.6284 5.5941 1.1663 2.6880 40.6018 42.5921 3.7193 11.7975 58.7106 30.8080 9.9749 3.6396 0.1713 0.2234 1.8744 0.1490 0.2842 73.1181 70.1540 9.8095 50.9923 146.5363 180.6956 23.1052 39.5780 5.6082 7.4851 4.7095 15.5147 12.7685 14.0633 106.1169 51.5783 10.5114 7.8178 11.0763 12.3842 13.4292 54.3174 50.3683 118.6582 92.9168 6.9069 11.3775 56.8023 42.2926 34.1123 52.2985 77.3921 66.8725 18.0855 51.9770 48.6336 19.7939 30.5740 25.1162 6.4217 17.6193 214.7026 7.6784 12.9637 11.2628 4.8661 4.9791 1.2261 6.0763
temp: 298.150 k
press: 1.00000 atm
elementType: 8 8 8 7 6 6 6 6 6 6 6 6 6 6 6 6 6 6 6 6 1 1 1 1 1 1 1 1 1 1 1 1 1 1 1 1 1 1 1
symmnumber: 1
zpe: 833266.1 jmol-1
zpe.correction: 0.317374 hartree
zpe.thermalcorrener: 0.336820 hartree
zpe.thermalcorrenthalpy: 0.337764 hartree
zpe.thermalcorrgfe: 0.267685 hartree
zpe.sumelectzpe: -900.009395 hartree
zpe.sumelectthermal: -899.989949 hartree
zpe.sumelectthermalent: -899.989005 hartree
zpe.sumelectthermalfe: -900.059085 hartree
dipole: 3.4467 0.1141 1.1346
dipole: 3.6304
quadrupole: -91.0907 -120.9251 -114.8554
quadrupole: 8.3503 -17.8538 7.2365
quadrupole: 17.8664 -11.9680 -5.8983 8.3503 -17.8538 7.2365
hfenergy: -900.3267694 hartree
pointgroup: C01 [X(C16H19N1O3)]
dipole: -1.3989695 -0.0383686 0.2855113 debye
polarizability: 230.6472551|-9.2640182|203.7667163|39.8896864|-1.1935895|142.1780714 unknown
InChI: InChI=1S/C16H19NO3/c1-19-13-7-3-11(4-8-13)15(17)16(18)12-5-9-14(20-2)10-6-12/h3-10,15-16,18H,17H2,1-2H3
charge 0 multiplicity 1
39 atoms
O  1.271637 -3.270553 -0.39368
O  -4.490459 2.192516 -0.236138
O  4.199934 2.426978 0.365683
N  -1.137176 -3.370602 0.577116
C  -0.577206 -1.979702 0.551962
C  0.594542 -1.98783 -0.518725
C  -1.608801 -0.885328 0.309533
C  1.577162 -0.846175 -0.299752
C  -1.79849 0.160212 1.250214
C  -2.413534 -0.882005 -0.85689
C  1.310788 0.454244 -0.80355
C  2.765656 -1.055637 0.434652
C  -2.758084 1.167531 1.043111
C  -3.386329 0.117149 -1.083288
C  2.197579 1.519765 -0.563361
C  3.670108 0.002558 0.682725
C  -3.55971 1.147959 -0.125284
C  3.380308 1.296865 0.184943
C  -5.337557 2.220034 -1.430519
C  5.442211 2.242485 1.116144
H  -0.096471 -1.819875 1.534866
H  0.137684 -1.893337 -1.530766
H  -1.861656 -3.524629 -0.136266
H  -1.483997 -3.647857 1.502141
H  -1.176935 0.191367 2.153053
H  -2.287022 -1.666059 -1.615601
H  0.400581 0.637566 -1.386854
H  2.985123 -2.069454 0.783186
H  0.532779 -3.868746 -0.033442
H  -2.902891 1.976702 1.765226
H  -3.988457 0.085928 -1.996462
H  2.000065 2.525482 -0.946823
H  4.587623 -0.194529 1.245941
H  -5.967969 1.311883 -1.498939
H  -4.732291 2.322049 -2.352411
H  -5.977345 3.106156 -1.308184
H  6.114927 1.519502 0.614025
H  5.243033 1.901718 2.151417
H  5.916042 3.235174 1.137997
