program: Gaussian 09
title: 000201407
version: EM64L-G09RevD.01
frameworkgroup: C1[X(C4H12O6P2S)]
method: RPBEPBE
basis: SDD
operation: Freq
keyword: #p
keyword: freq=noraman
keyword: PBEPBE/SDD
title: #p freq=noraman PBEPBE/SDD
converged: YES YES NO NO
title: Mulliken charges:
elementType: S P P O O O O O O C C C C H H H H H H H H H H H H
charge: -0.196237 0.960679 1.483456 -0.732575 -0.478205 -0.482857 -0.504054 -0.511872 -0.602213 -0.474376 -0.495559 -0.479452 -0.499140 0.247880 0.236772 0.248921 0.245955 0.291791 0.234774 0.245900 0.251980 0.246248 0.239758 0.248478 0.273947
chargesum: 0.00000
title: Mulliken charges with hydrogens summed into heavy atoms:
elementType: S P P O O O O O O C C C C
charge: -0.196237 0.960679 1.483456 -0.732575 -0.478205 -0.482857 -0.504054 -0.511872 -0.602213 0.259198 0.276961 0.264677 0.263044
polarizability: 1.44834269e+02 -3.50675971e+00 1.26114594e+02 -1.40633506e+01 2.67638876e+00 1.21441208e+02
1716.lowfreq: -9.9775 -5.6916 -0.0026 -0.0016 0.0005 8.3166 29.1384 35.2484 51.2395
frequency: 26.9385 35.1022 51.0611 57.6565 76.9641 88.8807 100.2679 115.9367 120.6373 126.3899 138.1295 144.5009 150.4109 163.3321 176.2488 199.7360 205.3265 243.5278 288.7823 318.2430 348.5425 353.6651 375.0829 391.4706 406.5703 477.3858 552.1924 644.8744 681.2944 695.7991 716.3912 747.6548 944.3508 953.7187 968.8108 985.5630 1067.3070 1113.6726 1116.2735 1121.0856 1129.9132 1130.0274 1131.4371 1136.4923 1139.1111 1421.0156 1425.9172 1429.4822 1430.9041 1456.6316 1457.2399 1457.8377 1462.8963 1468.4266 1471.6882 1477.6013 1481.7180 2987.3810 2988.3531 2995.7543 2999.8683 3090.9275 3101.7158 3105.5916 3111.0433 3134.8008 3137.1699 3138.4572 3140.6133
redmass: 5.0847 3.6938 4.4348 3.3760 2.6569 4.9108 1.1698 1.2936 1.8781 3.5788 1.6638 1.3821 2.2425 3.0694 5.8257 5.8889 4.6202 6.4897 8.3748 8.2727 7.0472 6.1870 8.0722 6.9094 8.9792 11.1950 13.3955 12.8489 11.2608 11.3301 12.1768 17.1529 11.0408 11.7751 11.9886 11.6220 15.9895 1.2336 1.2387 1.2423 1.2727 1.2911 1.2425 1.2836 1.2883 1.1224 1.1165 1.1184 1.1153 1.0496 1.0501 1.0504 1.0506 1.0516 1.0540 1.0535 1.0528 1.0298 1.0298 1.0288 1.0282 1.1056 1.1062 1.1068 1.1066 1.1031 1.1046 1.1041 1.1047
irintensity: 0.9193 1.7940 2.4699 4.7296 8.2083 3.1672 0.2479 1.9257 5.4974 2.3421 3.1649 2.3383 2.7734 7.5854 2.6704 1.0090 3.0702 6.6420 22.5645 74.9137 45.0562 1.5389 25.4168 5.4101 4.0834 57.5350 33.3689 60.2551 74.9676 7.3583 232.2429 721.9474 253.8850 206.4723 101.4088 45.0921 185.8628 0.6100 0.2155 1.7068 2.7714 2.4136 1.8857 0.5084 0.8167 2.6263 5.4981 6.5634 13.4891 4.0770 12.7845 13.9192 14.0880 8.8912 22.8707 16.1602 10.9280 61.3844 24.4920 34.0857 34.7502 23.6469 4.2981 10.3363 19.1504 9.4360 11.0338 7.2586 11.0192
temp: 298.150 k
press: 1.00000 atm
elementType: 16 15 15 8 8 8 8 8 8 6 6 6 6 1 1 1 1 1 1 1 1 1 1 1 1
symmnumber: 1
zpe: 463731.1 jmol-1
zpe.correction: 0.176626 hartree
zpe.thermalcorrener: 0.195964 hartree
zpe.thermalcorrenthalpy: 0.196908 hartree
zpe.thermalcorrgfe: 0.126920 hartree
zpe.sumelectzpe: -1690.364495 hartree
zpe.sumelectthermal: -1690.345157 hartree
zpe.sumelectthermalent: -1690.344213 hartree
zpe.sumelectthermalfe: -1690.414201 hartree
dipole: 0.3802 -2.8692 2.9967
dipole: 4.1662
quadrupole: -106.6881 -88.0831 -98.5155
quadrupole: 8.0445 -0.5279 -0.4121
quadrupole: -8.9259 9.6791 -0.7532 8.0445 -0.5279 -0.4121
hfenergy: -1690.541121 hartree
pointgroup: C01 [X(C4H12O6P2S1)]
dipole: 0.4793208 -0.9592674 -1.2396402 debye
dipolederiv: -0.6421826 -0.161742 0.0926853 -0.1443494 -0.4691796 0.038209 0.0765404 0.0255638 -0.3958004 2.4660075 0.4308072 -0.0066231 0.1030391 1.7089741 0.0928211 0.4497269 0.3323102 1.6180589 2.5858695 0.1757571 0.1268015 0.5025105 1.8571807 0.2340971 0.1841701 -0.3842279 1.9302714 -2.1038592 -0.4474416 -0.4995791 -0.5901002 -0.8583696 -0.2388904 -0.6082444 -0.1914173 -0.8362443 -0.6378745 0.0868362 0.1874476 0.0078524 -0.9671868 -0.371791 0.0635915 -0.4830813 -0.9035314 -0.6901094 0.1102744 0.0501115 0.2755552 -1.2237234 -0.1265669 0.0146395 -0.1045372 -0.5092591 -0.8695847 0.241735 -0.1816388 0.3631082 -1.0604091 0.2783784 -0.1954095 0.1994073 -0.6065567 -0.6801242 -0.0920136 0.1496026 -0.064471 -0.6055698 0.1146397 0.2339453 0.3271657 -1.2100293 -0.7439162 -0.006798 -0.0121043 -0.0561945 -0.6932031 -0.0832243 -0.0302142 -0.0098457 -0.6283476 0.2209864 -0.029618 0.0453239 -0.1402532 0.6841995 0.405424 -0.0065043 0.084667 0.2596163 0.25583 -0.250996 -0.0330531 -0.1165507 0.5534104 0.0805737 -0.1281335 0.3536915 0.2338412 0.3373691 -0.0916226 0.0306089 -0.349685 0.6440083 -0.248285 -0.0952992 0.0575914 0.1485316 0.1539018 -0.041416 0.1194408 0.1201685 0.3101357 -0.2662903 -0.1129395 -0.1370432 0.6036672 -0.0579319 -0.0990786 -0.0136695 -0.0253976 0.0019829 -0.0486421 0.0495956 0.050492 0.1314901 -0.0235734 0.0911084 -0.0702319 0.0749876 -0.0454262 -0.033177 -0.096348 0.0753851 0.0306015 0.1150574 0.0302458 0.0657232 0.0070633 0.0483359 -0.0376378 0.0385129 -0.0466592 -0.0874905 0.0960122 0.0640124 -0.0144308 0.0765559 -0.0598333 0.0567108 -0.0278774 0.062257 0.0281059 0.1049018 -0.0518135 -0.0645699 -0.0051924 0.0500694 -0.0276064 -0.0184017 -0.0846145 0.0253846 -0.048145 0.0068821 0.079491 -0.0999058 0.058249 0.0310428 0.086746 -0.0477466 0.0568355 0.0300061 0.0384286 0.080873 0.0444009 0.0179707 0.0191156 0.1413174 -0.0625775 -0.0102905 -0.0238301 -0.1089056 0.0164934 -0.0309339 -0.0396091 0.015261 0.0292426 -0.0394053 0.1255766 0.0444341 0.0548418 -0.1036081 0.0750793 0.032094 0.0615691 -0.099898 0.0431423 -0.022064 -0.0328198 0.0171049 0.0996982 0.0281037 0.1002883 0.0154393 0.1031842 0.0327824 -0.0299236 0.1163815 0.0507839 -0.033123 -0.0068032 -0.0975092 0.0399111 -0.0018133 -0.053492 0.0377501 0.0271935 -0.0173722 -0.1116694 -0.0485878 0.0531202 -0.0010816 -0.0501291 0.0001919 0.0098063 unknown
polarizability: 146.5259604|10.1943829|130.4184517|-4.4927675|-2.1850877|115.4456583 unknown
InChI: InChI=1S/C4H12O6P2S/c1-6-11(5,7-2)10-12(13,8-3)9-4/h1-4H3
charge 0 multiplicity 1
25 atoms
S  -3.0731 -1.543215 0.352739
P  -1.503933 -0.526707 -0.488787
P  1.23188 0.582882 0.738091
O  -0.101904 -0.544518 0.551003
O  -0.866719 -1.057211 -2.001169
O  -1.651038 1.112377 -0.976229
O  2.120192 -0.213661 1.943827
O  2.224298 0.328403 -0.644367
O  0.813689 2.069718 1.076052
C  -0.881911 -2.508386 -2.300402
C  -2.250186 2.100092 -0.031157
C  2.490433 -1.644686 1.788521
C  1.914072 1.071965 -1.898875
H  -1.880103 -2.939374 -2.104248
H  -0.115544 -3.03361 -1.703765
H  -0.641664 -2.568696 -3.371743
H  -2.534685 2.945774 -0.673526
H  -1.485612 2.404651 0.702974
H  -3.144127 1.675347 0.460462
H  3.12266 -1.781728 0.894919
H  1.580892 -2.265366 1.727389
H  3.055828 -1.87329 2.703297
H  2.799176 0.915527 -2.532319
H  1.778029 2.146013 -1.684578
H  1.012279 0.650298 -2.374609
