program: Gaussian 09
title: 000017100
version: EM64L-G09RevD.01
frameworkgroup: C1[X(C10H18O)]
method: RPBEPBE
basis: SDD
operation: Freq
keyword: #pfreq=noraman
keyword: PBEPBE/SDD
title: #p freq=noraman PBEPBE/SDD
converged: YES YES NO NO
title: Mulliken charges:
elementType: O C C C C C C C C C C H H H H H H H H H H H H H H H H H H
charge: -0.478935 -0.028014 0.288845 -0.472906 -0.484998 -0.526622 0.434095 -0.411391 -0.763498 -0.758465 -0.826348 0.202925 0.244946 0.197101 0.207600 0.248631 0.205331 0.203923 0.202326 0.215239 0.199232 0.253755 0.242128 0.213463 0.200650 0.330770 0.215847 0.225690 0.218680
chargesum: 0.00000
title: Mulliken charges with hydrogens summed into heavy atoms:
elementType: O C C C C C C C C C C
charge: -0.148166 0.174911 0.288845 -0.030859 -0.028768 -0.117368 0.434095 -0.209066 -0.095272 -0.102224 -0.166130
polarizability: 1.33164045e+02 6.62677007e+00 1.07816657e+02 4.93331703e-02 1.47477040e+00 8.60493292e+01
1716.lowfreq: -18.2052 -11.8310 -0.0006 -0.0004 -0.0004 4.3763 46.6080 72.9044 160.8462
frequency: 46.5521 72.9013 160.8179 169.6996 178.4986 205.2689 234.5025 250.5493 269.1066 283.0187 302.1490 318.7872 353.4213 368.8590 422.6448 453.3251 467.9668 501.2354 547.6771 629.0909 745.9329 766.2403 803.4359 810.4008 893.6949 908.7334 915.1091 924.0376 939.1626 962.6474 988.4653 1026.8710 1028.4019 1051.0160 1088.8237 1102.7215 1134.8646 1143.1309 1149.2360 1171.2300 1196.3351 1223.1682 1244.5711 1286.8985 1296.5780 1309.8394 1325.3484 1331.9559 1355.4696 1370.6837 1376.2557 1391.3233 1392.0106 1453.9472 1456.2834 1460.6003 1461.7797 1466.3336 1471.2542 1472.0794 1477.7969 1489.1724 1701.0810 2938.4694 2953.6193 2954.0265 2960.5151 2972.8268 2976.8361 2986.2035 3003.7537 3010.0310 3022.9965 3056.4824 3060.3737 3065.3075 3072.8135 3086.5728 3095.3218 3098.2820 3552.4874
redmass: 2.8714 3.0365 2.1937 1.4178 1.2714 1.4417 1.4173 2.0957 1.0467 2.5180 2.7564 2.1231 2.8216 2.1418 2.0308 2.5546 3.2644 3.1552 3.0453 3.4037 4.0709 2.3577 1.3007 1.8792 2.4948 1.5510 1.6614 1.7050 1.9150 2.0191 1.3340 1.4874 1.6039 2.0891 1.8890 1.4785 2.3345 1.3517 1.5385 2.3960 2.4994 1.5323 1.3923 1.3366 1.4014 1.3229 1.7095 1.4854 2.0553 1.5036 1.3710 1.2416 1.2142 1.0762 1.0692 1.0661 1.0532 1.0632 1.0740 1.0652 1.0719 1.0605 6.5029 1.0628 1.0495 1.0697 1.0592 1.0376 1.0381 1.0881 1.0671 1.0995 1.0965 1.0988 1.1018 1.0975 1.0981 1.0906 1.0981 1.0979 1.0660
irintensity: 0.7528 1.1087 0.3503 1.0983 0.7026 5.6193 5.8139 1.1267 113.5275 6.9431 1.3674 3.8448 5.8907 1.5622 2.6858 2.4288 4.1384 3.5295 3.3991 0.6883 8.6167 18.6361 8.5519 10.1292 8.3922 0.2149 2.8012 5.5971 1.5930 8.6427 0.5436 10.7004 12.8337 10.7130 6.4445 84.5594 1.3422 0.2125 4.8556 14.5106 14.7237 9.2116 6.8454 0.6548 2.4498 8.4416 27.2799 5.1411 4.4876 19.3815 18.0732 2.6843 27.1464 3.7669 10.5837 3.3310 9.0552 0.9966 5.7029 14.8833 7.3867 23.8109 1.3991 38.5138 48.1141 33.4690 33.1886 15.3111 40.5230 26.0124 45.0613 36.0855 32.7073 3.3663 42.8419 77.9905 23.0756 51.1543 24.9574 27.2546 4.4717
temp: 298.150 k
press: 1.00000 atm
elementType: 8 6 6 6 6 6 6 6 6 6 6 1 1 1 1 1 1 1 1 1 1 1 1 1 1 1 1 1 1
symmnumber: 1
zpe: 673903.8 jmol-1
zpe.correction: 0.256676 hartree
zpe.thermalcorrener: 0.269383 hartree
zpe.thermalcorrenthalpy: 0.270327 hartree
zpe.thermalcorrgfe: 0.218856 hartree
zpe.sumelectzpe: -466.179650 hartree
zpe.sumelectthermal: -466.166944 hartree
zpe.sumelectthermalent: -466.166000 hartree
zpe.sumelectthermalfe: -466.217471 hartree
dipole: 1.5041 -0.2807 -1.1452
dipole: 1.9112
quadrupole: -61.0692 -68.1770 -71.4291
quadrupole: 0.9878 0.3187 0.2415
quadrupole: 5.8226 -1.2853 -4.5373 0.9878 0.3187 0.2415
hfenergy: -466.4363267 hartree
pointgroup: C01 [X(C10H18O1)]
dipole: -0.5911608 -0.1177983 0.4495067 debye
polarizability: 133.1054347|-6.7378911|107.9289014|-0.2190251|-0.9762253|85.9956955 unknown
InChI: InChI=1S/C10H18O/c1-8-4-6-9(7-5-8)10(2,3)11/h4,9,11H,5-7H2,1-3H3
charge 0 multiplicity 1
29 atoms
O  -2.158123 0.067033 -1.426506
C  -0.50134 -0.043495 0.341318
C  -2.037331 -0.021819 0.0590
C  0.227322 -1.225623 -0.348004
C  0.188354 1.28485 -0.070587
C  1.706193 -1.305577 0.092039
C  2.414011 0.042101 0.040733
C  1.704141 1.199973 -0.049887
C  -2.722427 1.212548 0.693079
C  -2.73618 -1.313526 0.545387
C  3.929233 0.016346 0.095842
H  -0.388115 -0.166269 1.440751
H  0.162619 -1.081319 -1.44226
H  -0.269438 -2.186066 -0.117451
H  -0.12532 2.104883 0.605768
H  -0.163731 1.56745 -1.084528
H  2.248194 -2.028633 -0.552284
H  1.776297 -1.715892 1.123597
H  2.247646 2.155121 -0.107267
H  -2.543718 1.253299 1.78376
H  -3.817656 1.173597 0.533631
H  -2.346815 2.145548 0.242102
H  -2.381117 -2.192143 -0.017932
H  -2.549256 -1.488042 1.621494
H  -3.831894 -1.239442 0.403546
H  -3.121039 0.096957 -1.65983
H  4.286757 -0.501422 1.009032
H  4.358255 1.033806 0.091509
H  4.352078 -0.538541 -0.765851
