program: Gaussian 09
title: 000201379
version: EM64L-G09RevD.01
frameworkgroup: C1[X(C17H20ClN)]
method: RPBEPBE
basis: SDD
operation: Freq
keyword: #p
keyword: freq=noraman
keyword: PBEPBE/SDD
title: #p freq=noraman PBEPBE/SDD
converged: YES YES NO NO
title: Mulliken charges:
elementType: Cl N C C C C C C C C C C C C C C C C C H H H H H H H H H H H H H H H H H H H H
charge: -0.067670 -0.114239 -0.069233 -0.567983 -0.486833 -0.730379 0.502454 -0.640660 0.480929 -0.431592 -0.400258 -0.372106 -0.448751 -0.230334 -0.233764 -0.212734 -0.203711 -0.243256 -0.109705 0.227142 0.202669 0.223836 0.230638 0.200031 0.222579 0.212807 0.246913 0.222141 0.245497 0.191881 0.231350 0.233226 0.269083 0.237902 0.224314 0.223866 0.252699 0.253162 0.228090
chargesum: 0.00000
title: Mulliken charges with hydrogens summed into heavy atoms:
elementType: Cl N C C C C C C C C C C C C C C C C C
charge: -0.067670 -0.114239 0.157909 -0.141478 -0.056165 -0.048079 0.502454 0.018859 0.480929 -0.200242 -0.167032 -0.103023 -0.210849 -0.006020 -0.009898 0.039965 0.049451 -0.015166 -0.109705
polarizability: 2.87662300e+02 4.75345442e+00 1.52086234e+02 2.26765539e+00 -2.68905326e+01 1.50845423e+02
1716.lowfreq: -3.6867 -2.4032 -0.0019 0.0002 0.0006 4.5109 18.6347 22.3009 30.7755
frequency: 18.1610 22.0752 30.6245 48.2339 66.0158 80.2783 102.7756 128.0800 165.3268 215.0936 220.8156 229.8483 240.4040 260.3805 289.5850 305.7395 350.6368 362.1819 377.4829 403.2313 410.5145 412.3173 453.2230 489.2804 507.0017 532.7602 593.1027 618.0372 624.7573 658.2677 703.0850 704.8005 749.1775 780.9426 801.9820 824.3342 825.2147 838.2821 851.1409 857.5758 893.2377 915.7351 942.3134 967.3820 974.2252 980.4290 990.0377 992.8786 994.9329 1003.1314 1026.5637 1042.3419 1050.3258 1068.3659 1091.3055 1100.3465 1108.0700 1122.7396 1136.6951 1171.4672 1171.7745 1186.3121 1194.3842 1209.0315 1215.0236 1218.2765 1267.4717 1289.8697 1296.7654 1314.2062 1331.5765 1338.1121 1363.6301 1381.0063 1381.8343 1384.6068 1397.2229 1434.5623 1440.1180 1458.7400 1467.2326 1470.4528 1474.7000 1476.4427 1482.1059 1484.6701 1491.2793 1588.7981 1592.2786 1600.3025 1613.5935 2858.0092 2876.4020 2980.2841 2982.4514 2991.1880 3010.0081 3024.1021 3047.9514 3074.1573 3080.8836 3082.8358 3112.7629 3115.2429 3122.8978 3131.1366 3142.7390 3142.7884 3161.7223 3166.3310 3169.8965
redmass: 3.9611 6.3563 3.9818 3.2938 4.6704 4.3810 3.1467 5.6348 4.5634 1.9138 1.7392 1.1161 2.3278 4.5257 2.9423 4.5726 2.9511 2.3570 2.8447 2.8048 3.9187 2.9428 3.1686 3.0125 3.3305 2.8427 4.8112 6.3190 7.0142 4.7102 2.7212 2.1452 1.9038 3.2807 2.9912 1.7221 2.8069 1.2780 1.3379 2.2574 1.4312 1.4564 1.4185 1.7748 1.3915 1.4523 6.1845 1.3583 2.1891 2.6898 2.1865 1.6411 2.1300 2.6166 1.6050 1.3362 1.4705 2.1618 1.8610 1.0538 1.1215 1.1148 1.9966 2.6150 1.6401 2.1231 1.4584 1.3747 1.4851 1.3423 1.2762 1.7794 1.3569 1.7614 6.5734 2.3456 2.1050 1.1684 2.1475 1.1283 1.0951 1.2028 1.6622 1.1100 1.5530 1.3676 1.0533 7.4316 6.0288 6.2682 6.1868 1.0709 1.0554 1.0360 1.0682 1.0741 1.0849 1.0741 1.1021 1.0995 1.1007 1.0989 1.0872 1.0869 1.0898 1.0906 1.0957 1.0886 1.1014 1.0955 1.0958
irintensity: 0.0455 0.1465 0.0693 0.0170 0.1361 0.5677 0.3375 0.0238 0.5328 2.0466 0.4013 0.3323 1.3144 1.0136 0.9535 1.3030 0.9571 3.1090 8.4613 0.0031 3.8098 0.4372 1.5528 32.8346 6.2847 10.5396 19.3351 0.2528 0.3587 5.6890 22.5896 28.4679 40.7605 13.3754 16.6969 50.5342 2.9877 9.3762 0.5108 4.8030 4.6117 0.8520 8.9306 18.2194 0.1110 3.8303 0.1383 1.3275 23.7110 29.3355 8.3800 3.3711 48.7549 28.2327 8.1201 16.1425 16.2995 27.5266 52.6897 0.1855 3.1058 0.0317 15.6395 10.0379 9.2544 8.4881 5.9463 2.5282 21.6709 1.8377 2.1422 3.4176 10.5337 15.1043 2.4319 24.4313 5.4582 10.4133 7.7467 6.4721 26.1777 19.3594 66.3403 10.7165 14.7921 8.2150 5.2787 2.7021 1.6440 3.6064 12.6959 54.4814 123.1505 22.7318 7.6231 44.7927 18.1494 31.4213 19.2895 34.0814 33.6055 48.7122 9.1762 9.0791 11.3667 10.3228 43.9456 0.8918 26.4889 7.8611 2.6700
temp: 298.150 k
press: 1.00000 atm
elementType: 17 7 6 6 6 6 6 6 6 6 6 6 6 6 6 6 6 6 6 1 1 1 1 1 1 1 1 1 1 1 1 1 1 1 1 1 1 1 1
symmnumber: 1
zpe: 849441.1 jmol-1
zpe.correction: 0.323535 hartree
zpe.thermalcorrener: 0.342112 hartree
zpe.thermalcorrenthalpy: 0.343057 hartree
zpe.thermalcorrgfe: 0.273874 hartree
zpe.sumelectzpe: -1173.209885 hartree
zpe.sumelectthermal: -1173.191308 hartree
zpe.sumelectthermalent: -1173.190363 hartree
zpe.sumelectthermalfe: -1173.259546 hartree
dipole: 2.7528 1.8047 0.0180
dipole: 3.2916
quadrupole: -133.3081 -119.7813 -115.9327
quadrupole: -5.9897 1.5600 -5.9769
quadrupole: -10.3008 3.2261 7.0747 -5.9897 1.5600 -5.9769
hfenergy: -1173.5334201 hartree
pointgroup: C01 [X(C17H20Cl1N1)]
dipole: 1.0380703 0.7705956 0.075447 debye
polarizability: 286.4884624|12.7575992|156.9986685|6.4023719|-26.1123255|147.1068259 unknown
InChI: InChI=1S/C17H20ClN/c1-14(12-15-6-4-3-5-7-15)19(2)13-16-8-10-17(18)11-9-16/h3-11,14H,12-13H2,1-2H3
charge 0 multiplicity 1
39 atoms
Cl -6.722289 -1.705531 -0.342976
N  -0.352929 0.747557 0.754123
C  1.122724 0.875814 0.544657
C  1.64313 -0.261396 -0.389043
C  -1.190307 1.038465 -0.42998
C  1.584946 2.275793 0.056643
C  3.154936 -0.430519 -0.33516
C  -0.839485 1.436765 1.967865
C  -2.567779 0.378048 -0.364827
C  3.989361 0.03556 -1.383289
C  3.76728 -1.050638 0.786358
C  -2.732054 -0.898023 0.229328
C  -3.695517 1.009976 -0.943116
C  5.394466 -0.10772 -1.314418
C  5.170055 -1.196774 0.860874
C  -3.990405 -1.538897 0.242103
C  -4.963504 0.384042 -0.945765
C  5.990583 -0.723648 -0.190317
C  -5.088013 -0.885776 -0.352025
H  1.572622 0.695312 1.54188
H  1.331637 -0.060817 -1.432592
H  1.138923 -1.191929 -0.065828
H  -0.662031 0.654318 -1.323582
H  -1.329566 2.136238 -0.59663
H  1.245594 3.07299 0.742874
H  1.188181 2.496209 -0.952155
H  2.686881 2.320417 0.002833
H  -0.238106 1.123012 2.839555
H  -1.889081 1.151466 2.157956
H  -0.799139 2.551889 1.900021
H  3.533721 0.511081 -2.260967
H  3.137292 -1.431488 1.600579
H  -1.860122 -1.370738 0.694186
H  -3.590769 2.002809 -1.397751
H  6.021339 0.256883 -2.136292
H  5.623263 -1.683142 1.732369
H  -4.115629 -2.523712 0.701908
H  -5.832672 0.874734 -1.393229
H  7.078967 -0.838531 -0.135669
