program: Gaussian 09
title: 000201360
version: EM64L-G09RevD.01
frameworkgroup: C1[X(C8H17O5PS)]
method: RPBEPBE
basis: SDD
operation: Freq
keyword: #p
keyword: freq=noraman
keyword: PBEPBE/SDD
title: #p freq=noraman PBEPBE/SDD
converged: YES YES NO NO
title: Mulliken charges:
elementType: S P O O O O O C C C C C C C C H H H H H H H H H H H H H H H H H
charge: -0.272948 0.927597 -0.470769 -0.474250 -0.434787 -0.264219 -0.240175 -0.216505 -0.240827 -0.389713 -0.654845 -0.661755 0.303680 -0.261569 -0.658500 0.231632 0.224123 0.228044 0.223205 0.274831 0.263182 0.208664 0.232998 0.237191 0.203530 0.225421 0.290916 0.236079 0.226669 0.217731 0.230862 0.254508
chargesum: 0.00000
title: Mulliken charges with hydrogens summed into heavy atoms:
elementType: S P O O O O O C C C C C C C C
charge: -0.272948 0.927597 -0.470769 -0.474250 -0.434787 -0.264219 -0.240175 0.239250 0.210422 0.148300 0.024007 0.058111 0.303680 0.201180 0.044601
polarizability: 1.72679053e+02 1.35930865e+00 1.40208833e+02 -8.16612154e+00 -1.69568049e+00 1.28905864e+02
1716.lowfreq: -11.6796 -10.5442 -0.0005 0.0010 0.0013 4.3369 7.8847 16.6680 27.5102
frequency: -11.0148 15.4436 27.2772 34.4966 40.7477 62.3856 75.5819 84.6176 87.3447 98.0182 148.7615 160.3797 172.0689 198.8323 216.9122 240.8920 244.9669 250.3937 281.3146 297.8112 318.4506 366.5747 385.5449 388.9326 419.3790 464.7100 506.9631 542.1482 644.1779 672.9196 687.7258 709.3118 790.5397 807.6704 810.6455 820.0087 866.6966 877.7050 884.8351 985.1985 1000.3061 1007.3635 1017.9116 1036.2383 1096.1309 1098.0406 1106.8704 1134.8218 1149.7403 1150.9452 1157.2036 1231.0859 1253.4841 1269.5095 1274.7628 1342.9712 1348.6879 1356.0281 1357.7641 1393.2101 1395.3820 1397.0466 1422.2025 1457.8596 1458.7636 1462.4555 1463.3191 1471.4023 1477.6845 1482.9817 1488.0284 1494.3831 1660.8838 2987.0022 2987.9785 2994.7164 2995.1043 2996.9778 3009.3794 3032.2223 3056.1110 3074.2661 3082.9387 3090.6548 3093.4526 3093.6279 3095.9904 3111.7982 3116.5276 3122.2553
redmass: 4.0361 4.0809 3.0893 2.5663 3.5797 2.8030 4.8519 3.8004 3.8686 4.2956 3.1490 4.2466 2.5581 1.9623 2.1251 1.2777 1.9395 2.0422 3.3585 4.2030 4.0642 5.0990 3.7648 3.4370 5.6049 5.1125 5.9574 3.5775 5.0887 7.9871 7.9713 6.7269 1.5873 1.1294 1.0912 2.3212 4.2014 4.0012 3.9719 2.3788 2.8538 2.6369 2.9101 5.1188 2.1849 2.2054 2.2191 1.4164 4.3297 1.5204 1.6719 1.0885 1.1463 1.1200 1.1204 1.2489 1.2198 1.2536 1.3888 1.2272 1.2440 1.2170 1.0703 1.0397 1.0841 1.0472 1.0471 1.0719 1.0540 1.0530 1.0784 1.0522 9.6577 1.0380 1.0551 1.0366 1.0607 1.0381 1.0613 1.0599 1.1075 1.1033 1.0961 1.0975 1.1002 1.0981 1.1030 1.1022 1.1029 1.1064
irintensity: 1.9200 0.1649 0.8006 0.2616 1.4169 2.7022 3.3918 1.1691 0.6626 1.0589 5.7859 9.3713 0.1238 13.9411 1.8980 0.0252 0.8210 7.9528 3.3025 12.7811 17.1279 3.1280 2.0322 16.1924 8.1203 8.4680 12.3005 1.0044 22.5015 138.1223 96.8953 116.1128 10.1292 6.2949 5.5332 4.1979 193.2380 37.1661 152.1591 43.5169 55.3060 100.8380 292.3175 79.6937 28.5538 5.4749 6.3114 4.4379 250.0600 12.1397 19.5878 6.7199 0.1571 0.4429 4.5005 10.7243 7.6342 6.1259 10.0443 22.2628 26.7202 27.6909 33.9814 12.5207 12.7307 13.9760 4.1453 7.6245 6.3393 14.1864 10.9462 10.6019 182.1720 25.8224 22.7220 13.2894 40.4272 24.8597 17.5428 31.5701 12.4116 18.8413 24.1812 33.2484 3.0712 25.3185 1.0490 31.7449 6.1668 31.1975
temp: 298.150 k
press: 1.00000 atm
elementType: 16 15 8 8 8 8 8 6 6 6 6 6 6 6 6 1 1 1 1 1 1 1 1 1 1 1 1 1 1 1 1 1
symmnumber: 1
zpe: 661205.1 jmol-1
zpe.correction: 0.251840 hartree
zpe.thermalcorrener: 0.271179 hartree
zpe.thermalcorrenthalpy: 0.272123 hartree
zpe.thermalcorrgfe: 0.200692 hartree
zpe.sumelectzpe: -1429.220951 hartree
zpe.sumelectthermal: -1429.201612 hartree
zpe.sumelectthermalent: -1429.200667 hartree
zpe.sumelectthermalfe: -1429.272098 hartree
dipole: -1.0791 -0.1907 0.5250
dipole: 1.2151
quadrupole: -80.4753 -100.5811 -110.7709
quadrupole: 1.8852 3.4043 3.8354
quadrupole: 16.8005 -3.3054 -13.4951 1.8852 3.4043 3.8354
hfenergy: -1429.4727908 hartree
pointgroup: C01 [X(C8H17O5P1S1)]
dipole: 0.4310866 0.0980834 -0.1818382 debye
polarizability: 169.7747561|10.6259644|143.8553162|-5.7640678|-0.2143209|128.1636779 unknown
InChI: InChI=1S/C8H17O5PS/c1-4-10-8(9)7-13-14(15,11-5-2)12-6-3/h4-7H2,1-3H3
charge 0 multiplicity 1
32 atoms
S  -0.156367 -0.834624 -1.789902
P  -1.166914 -0.738686 0.018373
O  -2.166936 -2.061226 0.472327
O  -2.291454 0.539719 0.248844
O  -0.189343 -0.718299 1.457252
O  3.415398 -0.192294 1.015395
O  1.667783 1.350863 0.84282
C  -3.283358 -2.443878 -0.448043
C  -2.034169 1.901048 -0.325458
C  1.230357 -1.044981 1.349989
C  -3.928488 -3.678607 0.172576
C  -1.396285 2.820959 0.714117
C  2.080561 0.189953 1.039752
C  4.412231 0.866953 0.64754
C  4.541389 0.969346 -0.873999
H  -3.990203 -1.596309 -0.514003
H  -2.862836 -2.653779 -1.450823
H  -1.405416 1.795935 -1.231414
H  -3.041672 2.240236 -0.620085
H  1.511524 -1.452433 2.334831
H  1.428082 -1.80982 0.575037
H  -4.770997 -4.017419 -0.458345
H  -3.19803 -4.500933 0.25532
H  -4.31433 -3.449623 1.180094
H  -1.327992 3.84573 0.300529
H  -2.012332 2.8581 1.628792
H  -0.380925 2.480482 0.973961
H  4.084631 1.822364 1.093599
H  5.342258 0.521222 1.125392
H  5.328989 1.701755 -1.13098
H  4.818481 -0.004422 -1.312676
H  3.594563 1.307069 -1.327411
