program: Gaussian 09
title: 000201393
version: EM64L-G09RevD.01
frameworkgroup: C1[X(C21H24N2O4)]
method: RPBEPBE
basis: SDD
operation: Freq
keyword: #p
keyword: freq=noraman
keyword: PBEPBE/SDD
title: #p freq=noraman PBEPBE/SDD
converged: YES YES NO NO
title: Mulliken charges:
elementType: O O O O N N C C C C C C C C C C C C C C C C C C C C C H H H H H H H H H H H H H H H H H H H H H H H H
charge: -0.290737 -0.204176 -0.198508 -0.275560 -0.219577 -0.712427 -0.375688 -0.395471 -0.341085 -0.409511 0.085958 0.084020 0.183299 0.191853 -0.299846 -0.353814 -0.358211 0.185554 -0.207827 -0.209872 0.262545 -0.321943 -0.552976 -0.419420 0.534784 -0.457412 -0.513764 0.201185 0.237078 0.239390 0.240528 0.197477 0.227743 0.190021 0.211203 0.209213 0.199888 0.268361 0.269826 0.237890 0.238187 0.243253 0.254806 0.216778 0.237467 0.213309 0.304007 0.300017 0.202235 0.223407 0.226541
chargesum: 0.00000
title: Mulliken charges with hydrogens summed into heavy atoms:
elementType: O O O O N N C C C C C C C C C C C C C C C C C C C C C
charge: -0.290737 -0.204176 -0.198508 -0.275560 -0.219577 -0.108403 0.062575 0.084447 0.084135 -0.008286 0.085958 0.084020 0.183299 0.191853 0.109256 -0.085453 -0.088384 0.185554 0.030063 0.028316 0.262545 -0.078691 -0.298170 0.034825 0.534784 -0.244103 0.138419
polarizability: 2.34569348e+02 1.72470966e+01 2.98742219e+02 -4.48877459e+01 1.62270730e+00 2.16585266e+02
1716.lowfreq: -3.9849 -3.1391 -0.0007 -0.0005 0.0003 5.5654 7.9664 11.6421 17.6197
frequency: 7.5827 11.3717 17.5186 29.0823 34.2988 40.5559 69.2891 86.9536 92.3667 103.7037 135.7898 138.3999 149.0754 152.8617 160.1490 173.4862 195.3818 210.2235 213.3528 235.0663 258.0790 266.2687 298.7540 301.5483 315.3856 332.8038 338.8223 347.4976 359.6028 406.8147 409.5762 418.5980 440.1217 445.3791 455.3705 507.8149 522.2375 532.9592 563.3064 573.4973 587.1237 606.6685 658.9449 679.3863 690.5368 710.4284 711.9437 720.5377 738.8103 764.3398 784.8753 794.0179 794.9926 816.1939 837.4439 859.3855 869.2398 894.0933 903.9342 906.5612 909.2462 922.6213 946.4306 956.1064 974.3439 992.3099 993.6448 1006.4408 1014.3954 1036.6511 1039.8325 1049.9746 1051.5774 1072.4895 1087.5933 1098.8859 1105.8446 1116.9471 1141.9419 1153.6034 1166.8814 1170.8715 1174.2843 1186.6241 1203.4083 1205.7763 1212.3393 1243.0733 1266.9246 1268.7280 1274.5529 1282.9122 1297.9625 1314.1638 1327.6316 1332.8569 1337.4453 1353.1545 1362.4587 1369.2540 1373.5264 1392.0624 1417.0692 1429.7219 1448.2053 1448.7257 1451.4897 1454.2568 1454.5531 1456.6236 1462.0692 1463.7260 1475.7183 1478.3612 1481.8478 1498.9985 1591.4026 1615.5407 1617.5430 1626.5245 1633.0898 1644.4310 1675.3833 2935.0120 2939.8884 2971.6231 2975.0769 2975.3843 2981.8067 3000.3239 3010.8422 3014.7686 3026.2734 3035.7763 3040.3248 3061.5746 3077.6439 3098.7344 3121.9760 3126.4403 3140.0409 3153.0353 3159.7618 3164.3281 3174.8112 3573.2345 3714.5087
redmass: 5.9772 5.5998 6.0894 5.6682 6.1663 3.0209 4.5187 3.4133 3.3852 2.5432 3.8574 4.8835 2.9904 1.9376 3.1139 4.9786 3.0955 2.3306 3.3602 4.7757 2.6785 3.2133 2.9180 1.2176 3.8932 6.8357 1.0631 3.2667 6.0440 2.7941 2.9796 3.7125 3.5761 3.2878 4.8790 3.5545 6.1377 3.6323 3.8269 4.1258 7.7483 4.1861 4.8114 5.9825 5.5168 2.5341 3.1380 2.9625 2.0501 2.3490 5.3072 1.5255 1.6575 2.5544 2.1993 4.7841 2.8941 1.4826 1.9255 1.3928 1.9496 2.3404 2.8890 2.3010 1.4132 2.7461 2.5280 1.3470 2.1706 1.7728 1.8081 4.2285 2.4053 2.6567 2.1654 2.7068 2.2987 1.3212 1.8954 1.4393 1.2430 1.9962 1.4307 1.5464 2.5197 2.3635 1.2928 1.3253 1.3846 1.3482 1.2792 1.4920 1.0885 1.4010 1.9817 1.8904 2.9859 1.3377 1.6220 1.3705 1.5882 4.1207 5.9799 1.1878 1.6361 1.3836 1.1027 2.4146 1.1196 1.8194 1.4640 1.1034 1.2041 1.0633 1.0993 2.4489 7.4959 7.7267 8.4039 10.6324 1.6975 2.3327 11.7147 1.0338 1.0550 1.0606 1.0622 1.0625 1.0653 1.1023 1.0612 1.1015 1.0931 1.1007 1.1014 1.1029 1.1047 1.0987 1.0889 1.0904 1.0864 1.0905 1.0939 1.0956 1.1004 1.0447 1.1041
irintensity: 0.3059 0.5238 0.0894 0.0587 1.2264 0.8753 1.8433 1.5998 7.3025 0.0508 1.5229 0.4708 1.8470 1.7294 6.5956 0.1048 2.5495 8.4500 5.5030 0.0861 1.9266 5.1626 4.3095 299.5867 9.9518 7.3476 0.1964 4.6158 0.8549 1.2350 2.3767 1.9013 5.4752 5.8795 0.0153 1.5781 8.5855 1.6928 7.4835 2.1904 3.6849 6.7767 0.0196 2.6949 2.9436 9.9580 103.6489 8.8707 5.1276 3.4761 0.0510 64.0927 16.9214 3.4311 17.4113 10.0815 10.4848 29.3061 0.6548 0.0256 6.5104 23.3974 2.7425 35.7614 2.4539 41.3762 17.8836 0.0004 9.1121 8.5096 36.5751 56.7905 48.9655 9.3267 3.7534 1.4107 15.3765 1.8458 9.1033 7.1346 7.1981 4.1029 22.0803 16.9234 38.9543 192.0417 17.5971 15.3164 7.1247 10.8434 0.9947 0.5698 7.3866 35.1944 8.9766 47.8217 203.9248 3.0147 43.7854 9.9783 18.1352 21.6108 8.2663 4.6793 0.8147 20.2592 8.1647 10.3119 2.0098 11.1323 44.6447 7.2788 112.4726 7.6700 10.1038 181.3153 5.1285 3.3496 143.1207 279.9760 20.0277 183.3385 48.8675 65.8830 42.8356 42.2461 16.9891 0.3792 53.6916 64.4326 30.3171 53.1900 21.2117 5.3540 16.7711 75.3373 12.6675 34.9864 19.3364 17.9837 1.5469 4.5272 15.1597 6.0315 19.5995 63.1160 18.0272
temp: 298.150 k
press: 1.00000 atm
elementType: 8 8 8 8 7 7 6 6 6 6 6 6 6 6 6 6 6 6 6 6 6 6 6 6 6 6 6 1 1 1 1 1 1 1 1 1 1 1 1 1 1 1 1 1 1 1 1 1 1 1 1
symmnumber: 1
zpe: 1081224.7 jmol-1
zpe.correction: 0.411817 hartree
zpe.thermalcorrener: 0.438289 hartree
zpe.thermalcorrenthalpy: 0.439234 hartree
zpe.thermalcorrgfe: 0.350598 hartree
zpe.sumelectzpe: -1223.061903 hartree
zpe.sumelectthermal: -1223.035431 hartree
zpe.sumelectthermalent: -1223.034486 hartree
zpe.sumelectthermalfe: -1223.123122 hartree
dipole: 2.7124 0.5781 -0.4130
dipole: 2.8039
quadrupole: -141.0873 -133.0976 -165.3396
quadrupole: -4.5062 -3.1057 -3.6286
quadrupole: 5.4208 13.4106 -18.8314 -4.5062 -3.1057 -3.6286
hfenergy: -1223.47372 hartree
pointgroup: C01 [X(C21H24N2O4)]
dipole: 1.0179417 -0.424871 -0.0131292 debye
polarizability: 242.8588796|-7.8024052|303.2369693|40.1166459|0.49932|203.8009834 unknown
InChI: InChI=1S/C21H24N2O4/c1-26-14-15-13-16(22)9-10-19(15)27-12-6-2-5-11-23-20(24)17-7-3-4-8-18(17)21(23)25/h3-4,7-10,13H,2,5-6,11-12,14,22H2,1H3
charge 0 multiplicity 1
51 atoms
O  1.844253 1.245883 -0.577822
O  -4.207088 1.297239 -1.282759
O  -2.246078 1.293504 3.000252
O  1.405855 -2.739879 -1.795588
N  -3.169388 1.638695 0.831375
N  6.077658 -2.413561 0.300973
C  -1.817665 3.507823 -0.17398
C  -2.989867 3.098029 0.74967
C  -0.455949 2.926145 0.261507
C  0.696903 3.368824 -0.665482
C  -3.750973 0.847755 -0.201089
C  -2.765156 0.845732 1.947583
C  -3.697049 -0.566821 0.294287
C  -3.104837 -0.567634 1.580916
C  2.028828 2.685631 -0.339212
C  -4.120424 -1.756166 -0.316629
C  -2.914876 -1.757395 2.298895
C  2.948927 0.39199 -0.339646
C  -3.931343 -2.966626 0.40069
C  -3.337418 -2.967285 1.688166
C  2.722944 -0.991713 -0.581748
C  4.214696 0.831518 0.111491
C  3.769399 -1.90766 -0.359822
C  1.352639 -1.478496 -1.04369
C  5.050505 -1.482873 0.0929
C  5.256391 -0.096719 0.326072
C  1.928984 -2.559449 -3.152331
H  -1.773094 4.616062 -0.179497
H  -2.048088 3.193328 -1.210038
H  -2.811856 3.447553 1.78277
H  -3.933777 3.537688 0.379867
H  -0.235841 3.227606 1.305917
H  -0.500835 1.821261 0.256465
H  0.844615 4.465901 -0.593807
H  0.436021 3.146635 -1.719063
H  2.842616 3.069396 -0.990005
H  2.312912 2.852731 0.722023
H  -4.575145 -1.743972 -1.312061
H  -2.454775 -1.745716 3.29186
H  -4.24418 -3.915968 -0.046883
H  -3.201018 -3.917138 2.216047
H  4.406265 1.891566 0.302556
H  3.56997 -2.968553 -0.555858
H  0.851066 -0.687943 -1.638225
H  0.709556 -1.70781 -0.173862
H  6.232803 0.259512 0.676662
H  5.915991 -3.404587 0.153104
H  6.98729 -2.117778 0.640364
H  1.295828 -1.85587 -3.73376
H  2.971081 -2.180428 -3.144736
H  1.901328 -3.554667 -3.624422
