program: Gaussian 09
title: 000201352
version: EM64L-G09RevD.01
frameworkgroup: C1[X(C16H28N2O3S)]
method: RPBEPBE
basis: SDD
operation: Freq
keyword: #p
keyword: freq=noraman
keyword: PBEPBE/SDD
title: #p freq=noraman PBEPBE/SDD
converged: YES YES NO NO
title: Mulliken charges:
elementType: S O O O N N C C C C C C C C C C C C C C C C H H H H H H H H H H H H H H H H H H H H H H H H H H H H
charge: 1.001752 -0.305052 -0.556379 -0.556459 -0.494013 -0.708384 -0.380699 -0.366604 -0.386150 -0.376552 -0.356045 -0.322827 -0.357511 0.194186 0.359813 -0.700214 -0.519495 -0.587268 -0.343738 0.485910 -0.436502 -0.712826 0.183029 0.184195 0.195174 0.220894 0.254271 0.180470 0.190676 0.209798 0.183412 0.179998 0.215376 0.196630 0.206036 0.192497 0.207739 0.212828 0.206904 0.275565 0.282079 0.237808 0.229758 0.311310 0.216863 0.271736 0.282455 0.281831 0.314806 0.300921
chargesum: 0.00000
title: Mulliken charges with hydrogens summed into heavy atoms:
elementType: S O O O N N C C C C C C C C C C C C C C C C
charge: 1.001752 -0.305052 -0.556379 -0.556459 -0.182703 -0.092657 -0.013475 0.049464 0.048591 0.023922 0.007365 0.089178 0.041022 0.194186 0.359813 -0.072744 0.038149 -0.349461 -0.113980 0.485910 -0.219638 0.123197
polarizability: 2.31379147e+02 1.02912690e+01 2.52055564e+02 -2.82589900e+01 1.65399815e+01 2.04339330e+02
1716.lowfreq: -2.4485 -0.0009 0.0016 0.0020 3.2907 7.0497 15.9122 20.1213 29.5821
frequency: 15.7078 20.0703 29.5376 40.0328 49.7011 56.8239 59.2937 70.5019 88.8154 97.4385 122.7377 135.7764 148.0031 154.9405 165.6582 169.3132 180.4173 181.2176 209.8399 226.4854 233.4641 239.2791 246.9304 270.7572 297.6798 311.8356 327.9347 332.7485 338.5174 350.4869 378.6766 393.3809 401.3594 432.0549 435.5580 457.4912 463.3782 502.5311 545.5866 569.3352 574.2887 605.2169 695.5853 710.9399 725.0092 729.6823 736.0385 760.1321 793.6822 802.0544 810.5032 820.8990 864.4911 867.2623 883.9253 890.4349 891.1363 916.3486 935.7827 940.4676 954.3007 983.8328 988.0912 1004.9371 1013.9263 1024.6115 1039.2064 1051.2032 1052.8121 1063.6467 1080.2636 1086.7862 1107.5540 1119.9366 1138.2486 1166.8352 1191.2726 1202.2097 1206.7475 1220.9654 1232.4523 1249.9489 1262.9614 1270.8960 1279.2709 1285.4098 1290.2622 1294.2826 1300.7360 1313.9004 1323.5643 1332.3519 1346.9741 1354.0256 1360.5673 1362.1036 1363.9339 1386.2686 1387.5953 1410.2756 1413.2181 1418.2515 1447.8412 1457.5677 1462.9545 1463.0926 1465.7530 1471.1011 1475.5033 1478.0080 1485.1812 1491.4937 1497.8408 1588.4970 1635.4272 1646.0275 2945.1378 2946.9844 2957.1770 2960.6790 2967.5272 2968.6865 2969.8077 2984.9886 2988.0530 2991.9928 2992.8027 3015.3693 3019.5752 3032.9357 3037.0396 3037.7306 3051.8579 3064.4955 3064.9790 3066.6404 3110.6043 3121.7704 3149.0852 3185.3340 3195.4411 3343.3050 3565.5641 3706.4042
redmass: 4.9033 4.1674 4.9577 5.9192 3.4884 3.8714 4.7579 1.7627 3.3942 3.2500 1.8505 2.6423 4.3206 3.0174 2.3886 1.8413 2.0823 2.3916 2.9688 1.1269 2.8094 3.4322 3.5061 4.6298 3.2421 4.3733 4.7892 2.6805 1.3966 3.4342 1.2113 5.0055 3.6591 3.8298 3.0286 2.9106 4.4016 2.9575 4.6122 4.5419 2.7110 5.5280 3.3831 3.7094 1.1954 1.1425 2.6673 1.2412 5.0916 1.5976 1.8185 1.4879 1.6481 2.1753 1.8490 2.3012 2.2427 1.3701 1.7485 2.2223 2.1615 1.3675 2.3895 1.7036 2.2334 2.9434 2.2778 1.9180 1.8597 2.7238 2.1263 2.2384 2.5295 2.3109 1.9425 1.4276 1.6701 1.7530 1.1072 1.5074 1.3603 1.2752 1.3537 1.2409 1.2046 1.0873 1.3875 1.0795 1.1639 1.1441 1.3286 2.7170 1.5148 1.3018 1.5673 1.4627 1.4857 1.2229 3.2819 1.1230 1.0517 1.0522 1.0856 2.2185 1.2714 1.1096 1.0640 1.0712 1.0430 1.0845 1.0808 1.0983 2.9867 7.4582 2.1853 1.7240 1.0587 1.0587 1.0603 1.0610 1.0451 1.0531 1.0669 1.0941 1.0612 1.0613 1.0961 1.0990 1.0958 1.1037 1.0991 1.0250 1.1006 1.1059 1.1009 1.0992 1.0908 1.0876 1.0958 1.1074 1.1076 1.0739 1.0449 1.1040
irintensity: 0.0755 0.0285 0.2833 6.2057 0.5467 0.9568 4.7945 0.1035 0.9728 1.0620 0.1273 0.2259 1.8271 0.3962 0.7099 4.6261 0.9741 2.4994 1.6790 0.0222 3.5606 6.7943 0.1669 16.1876 3.0721 37.4278 36.4804 62.4895 93.8121 6.3446 133.9798 53.8301 6.0179 26.9495 0.9943 0.3732 8.8827 1.7346 1.1668 12.4523 9.9320 35.4391 9.1602 10.9268 10.9030 8.6697 9.5615 7.1423 35.4944 30.0433 127.7782 53.7561 25.7072 5.8389 23.4978 26.7821 25.6279 2.5935 32.2313 12.0491 14.8670 27.7809 20.0032 3.6602 20.1615 4.3221 30.8673 14.0860 12.6764 2.1199 2.5997 7.4319 21.0028 10.9464 1.2032 16.3347 1.4040 82.9057 16.9548 79.6298 5.0775 16.0381 15.1307 1.0462 2.2370 5.2775 6.2265 1.1461 0.3079 5.9257 1.7381 6.4973 1.6287 4.7127 1.4614 16.7755 10.2764 11.5586 6.4355 5.2098 12.3772 13.9699 7.6168 64.5554 2.2708 1.1862 2.6620 1.5667 11.2824 0.9657 2.4645 13.6376 194.2396 7.1818 2.7836 221.9049 0.3181 22.4570 20.9712 41.0382 70.8571 13.3263 77.8013 13.5250 45.0326 4.8791 5.3851 7.7732 21.2314 44.4883 1.2292 0.0876 120.4718 44.8190 117.5674 52.5889 3.3219 23.8867 19.2172 0.5538 0.3828 13.9574 63.5750 20.4426
temp: 298.150 k
press: 1.00000 atm
elementType: 16 8 8 8 7 7 6 6 6 6 6 6 6 6 6 6 6 6 6 6 6 6 1 1 1 1 1 1 1 1 1 1 1 1 1 1 1 1 1 1 1 1 1 1 1 1 1 1 1 1
symmnumber: 1
zpe: 1101462.0 jmol-1
zpe.correction: 0.419525 hartree
zpe.thermalcorrener: 0.446220 hartree
zpe.thermalcorrenthalpy: 0.447164 hartree
zpe.thermalcorrgfe: 0.360334 hartree
zpe.sumelectzpe: -1357.815304 hartree
zpe.sumelectthermal: -1357.788609 hartree
zpe.sumelectthermalent: -1357.787665 hartree
zpe.sumelectthermalfe: -1357.874495 hartree
dipole: -0.9848 0.5700 -0.9831
dipole: 1.5037
quadrupole: -143.1468 -126.7399 -133.4781
quadrupole: 2.6846 -14.2850 -10.2997
quadrupole: -8.6918 7.7150 0.9768 2.6846 -14.2850 -10.2997
hfenergy: -1358.2348287 hartree
pointgroup: C01 [X(C16H28N2O3S1)]
dipole: -0.4222383 -0.223857 0.3487167 debye
polarizability: 228.0481017|-11.9060149|249.1798198|29.1423434|19.6307889|210.5461199 unknown
InChI: InChI=1S/C16H28N2O3S/c1-3-4-5-6-7-8-11-21-16-10-9-15(17)12-14(16)13-18-22(2,19)20/h9-10,12,18H,3-8,11,13,17H2,1-2H3
charge 0 multiplicity 1
50 atoms
S  -0.046796 -2.866778 0.269204
O  -1.493965 2.074815 1.974535
O  1.135719 -1.771941 0.014447
O  -0.897699 -3.524616 -0.963449
N  -1.229094 -2.144192 1.570297
N  -3.692095 -0.289667 -2.673762
C  2.8156 1.743476 0.852053
C  1.361475 2.243057 0.694611
C  3.270059 0.85209 -0.326584
C  0.823686 2.972396 1.946214
C  4.719907 0.338786 -0.182304
C  -0.67498 3.311828 1.878292
C  5.153139 -0.5836 -1.344834
C  -2.049756 1.538827 0.783456
C  -1.924379 0.134706 0.597152
C  6.596016 -1.112403 -1.193998
C  -1.167081 -0.664623 1.654817
C  -2.482878 -0.458079 -0.553143
C  -2.759603 2.316376 -0.156779
C  -3.169474 0.321184 -1.529108
C  -3.313581 1.718532 -1.307289
C  0.693727 -4.294861 1.278211
H  2.898585 1.161975 1.794883
H  3.503056 2.609487 0.958567
H  1.292007 2.915767 -0.185551
H  0.716092 1.374392 0.4643
H  2.580754 -0.013077 -0.407191
H  3.175319 1.420521 -1.275859
H  1.387046 3.917069 2.103809
H  0.993839 2.348757 2.846586
H  4.818098 -0.214933 0.775537
H  5.418574 1.200174 -0.117169
H  -0.979518 3.930925 2.741081
H  -0.913331 3.85532 0.943122
H  4.446196 -1.435291 -1.409017
H  5.058813 -0.030446 -2.301798
H  7.323098 -0.278704 -1.158957
H  6.87799 -1.771171 -2.036479
H  6.708738 -1.693005 -0.258421
H  -0.097115 -0.379091 1.648544
H  -1.53763 -0.404882 2.664734
H  -2.356464 -1.531502 -0.745042
H  -2.893533 3.390811 0.010878
H  -2.165387 -2.488588 1.275543
H  -3.856279 2.3348 -2.03415
H  -0.138956 -4.96222 1.536704
H  1.428137 -4.775112 0.616714
H  1.152651 -3.835094 2.162417
H  -3.503394 -1.269549 -2.864674
H  -4.140933 0.262851 -3.397651
