program: Gaussian 09
title: 000201337
version: EM64L-G09RevD.01
frameworkgroup: C1[X(C11H17NO3S)]
method: RPBEPBE
basis: SDD
operation: Freq
keyword: #p
keyword: freq=noraman
keyword: PBEPBE/SDD
title: #p freq=noraman PBEPBE/SDD
converged: YES YES NO NO
title: Mulliken charges:
elementType: S O O O N C C C C C C C C C C C H H H H H H H H H H H H H H H H H
charge: 0.946396 -0.301682 -0.558343 -0.577630 -0.709791 -0.799600 0.462136 0.249956 -0.591673 -0.316801 0.540734 -0.298837 -0.772679 -0.441956 -0.365353 -0.686495 0.281413 0.290410 0.234332 0.233314 0.193250 0.213086 0.285052 0.260871 0.277137 0.235070 0.241535 0.219037 0.204639 0.231400 0.207164 0.305381 0.308527
chargesum: 0.00000
title: Mulliken charges with hydrogens summed into heavy atoms:
elementType: S O O O N C C C C C C C C C C C
charge: 0.946396 -0.301682 -0.558343 -0.577630 -0.095883 -0.227777 0.462136 0.249956 -0.357341 -0.083487 0.540734 0.107498 0.050382 -0.222919 0.111252 -0.043293
polarizability: 2.23578013e+02 -8.36730151e+00 1.92320559e+02 -1.39919689e+01 6.16854574e-01 1.13426181e+02
1716.lowfreq: -15.0800 -10.4782 -2.7020 -0.0010 -0.0009 -0.0007 10.1143 30.2858 49.3591
frequency: 8.4159 29.9031 49.2640 54.1821 58.6245 83.3576 137.7837 141.8577 164.8211 174.1762 184.2547 206.2916 237.3011 249.2474 263.1581 279.1862 310.7536 323.2322 325.8362 329.0875 348.6148 371.7483 410.3424 442.2234 458.8067 479.6059 526.3902 562.5717 592.8730 628.5870 705.6927 734.9335 745.8516 751.8286 788.4048 806.0030 859.6953 875.8573 877.6646 888.9662 890.9886 923.1884 951.1441 966.0801 976.0986 999.2705 1038.5316 1045.3024 1097.3925 1111.6554 1136.8960 1155.2321 1175.5123 1196.8805 1213.9928 1238.4174 1276.5377 1285.8298 1289.5543 1310.7937 1336.3617 1367.0597 1393.4804 1394.7026 1415.5678 1418.5808 1424.5457 1459.6027 1470.9170 1479.9064 1481.0517 1493.0953 1499.5910 1586.2388 1635.3523 1648.0579 2971.8777 2975.1104 3014.2557 3027.2865 3046.7310 3059.5528 3060.6106 3082.1436 3085.2185 3123.4828 3126.3976 3158.1325 3162.2525 3175.1261 3182.4730 3571.5119 3711.1178
redmass: 4.7941 3.9367 3.9117 3.6978 2.5124 3.7691 4.1225 3.4458 2.3576 1.6201 4.6035 1.4257 2.2784 3.1037 2.8842 2.9137 4.0847 4.1843 2.6440 1.2970 1.3295 5.4146 4.8357 3.1648 5.0964 3.4974 4.9697 5.9207 3.6585 4.1778 4.2210 3.1500 1.2677 4.1697 9.9043 1.4990 1.8849 1.5621 2.3140 1.4751 1.5948 1.3544 2.3251 1.4862 5.9059 1.7274 1.5093 2.8535 1.2190 2.1915 1.6817 1.7188 1.2371 1.8917 1.8644 1.2616 1.5005 1.1146 1.1354 1.3101 2.6480 1.3908 1.3502 3.6214 1.0546 1.1289 1.2180 3.2987 1.0740 1.0440 1.0726 1.0958 3.0997 7.4100 2.0621 1.8498 1.0506 1.0506 1.0612 1.0244 1.0981 1.0989 1.0560 1.0987 1.1031 1.0903 1.0903 1.1125 1.0940 1.1069 1.1075 1.0450 1.1040
irintensity: 6.6173 3.1910 3.6649 2.2662 1.0832 1.8449 0.7720 2.4724 0.0313 1.3045 6.0324 0.1921 0.2627 1.6612 0.7124 6.8912 15.6918 29.8790 19.2850 135.9750 166.3737 16.6370 14.6552 2.8625 3.5660 3.7004 20.3647 30.2763 5.1922 4.5788 13.4121 5.1433 4.4086 3.9218 50.3246 47.2403 25.8393 3.4824 37.8862 2.7438 24.0453 0.6053 8.2119 34.1235 101.5254 56.2902 6.8660 6.8329 19.6046 8.3177 27.4556 0.4272 22.2370 30.0101 126.0879 27.8460 2.3946 0.1647 7.2656 10.5842 42.9721 13.4946 29.6842 15.4700 7.6659 26.0209 8.4717 29.4401 2.0319 10.3979 6.5809 12.8164 256.8907 17.9976 4.6859 217.0440 14.9773 94.0883 15.7173 2.4948 12.1153 5.2964 10.3500 32.3753 64.5246 8.6545 24.3095 0.5712 16.6190 1.8916 0.9365 76.6356 20.5405
temp: 298.150 k
press: 1.00000 atm
elementType: 16 8 8 8 7 6 6 6 6 6 6 6 6 6 6 6 1 1 1 1 1 1 1 1 1 1 1 1 1 1 1 1 1
symmnumber: 1
zpe: 692542.6 jmol-1
zpe.correction: 0.263776 hartree
zpe.thermalcorrener: 0.282703 hartree
zpe.thermalcorrenthalpy: 0.283647 hartree
zpe.thermalcorrgfe: 0.214507 hartree
zpe.sumelectzpe: -1106.453762 hartree
zpe.sumelectthermal: -1106.434834 hartree
zpe.sumelectthermalent: -1106.433890 hartree
zpe.sumelectthermalfe: -1106.503031 hartree
dipole: -2.1099 4.0369 -3.1472
dipole: 5.5365
quadrupole: -76.8476 -107.2198 -111.0440
quadrupole: 7.0767 -12.7635 8.9953
quadrupole: 21.5229 -8.8494 -12.6735 7.0767 -12.7635 8.9953
hfenergy: -1106.7175375 hartree
pointgroup: C01 [X(C11H17N1O3S1)]
dipole: 0.145144 1.9221145 -1.0144741 debye
polarizability: 205.3265489|-15.4039439|206.0101807|-16.6202629|20.3072589|117.988023 unknown
InChI: InChI=1S/C11H17NO3S/c1-3-6-15-11-5-4-10(12)7-9(11)8-16(2,13)14/h4-5,7H,3,6,8,12H2,1-2H3
charge 0 multiplicity 1
33 atoms
S  0.163037 -2.757136 0.001886
O  1.136883 0.346509 -1.150448
O  0.679612 -1.936101 1.321559
O  -0.725166 -4.124259 0.18222
N  -3.928458 1.625447 1.036067
C  -0.87841 -1.529167 -1.291611
C  -1.139305 -0.224349 -0.660942
C  -0.092536 0.742563 -0.58643
C  -2.407922 0.077664 -0.10921
C  -0.34535 1.998448 0.006533
C  -2.670783 1.33323 0.498388
C  2.356253 1.103122 -0.789899
C  1.732151 -3.23048 -0.995135
C  -1.617302 2.291218 0.538123
C  2.789294 0.868671 0.667609
C  4.14974 1.53969 0.956977
H  -0.173906 -1.49433 -2.134918
H  -1.756791 -2.16439 -1.47552
H  -3.198832 -0.681192 -0.15671
H  0.438701 2.758804 0.068548
H  2.214025 2.181861 -1.007515
H  3.116728 0.714736 -1.49018
H  2.320079 -3.863538 -0.31614
H  1.39719 -3.784077 -1.883658
H  2.238891 -2.28715 -1.239866
H  2.019239 1.256993 1.358464
H  2.838529 -0.219635 0.85354
H  -1.79287 3.270628 0.99959
H  4.107014 2.634277 0.797259
H  4.452911 1.365997 2.004408
H  4.947668 1.135078 0.305503
H  -4.099922 2.509835 1.504083
H  -4.656993 0.918935 1.066125
