program: Gaussian 09
title: 000201327
version: EM64L-G09RevD.01
frameworkgroup: C1[X(C13H10N2O)]
method: RPBEPBE
basis: SDD
operation: Freq
keyword: #p
keyword: freq=noraman
keyword: PBEPBE/SDD
title: #p freq=noraman PBEPBE/SDD
converged: NO YES NO NO
title: Mulliken charges:
elementType: O N N C C C C C C C C C C C C C H H H H H H H H H H
charge: -0.286204 -0.496922 -0.447751 0.356707 0.376833 0.332922 0.073952 0.102883 -0.413959 -0.433712 -0.386309 -0.284994 -0.241105 -0.210582 -0.251129 -0.281523 0.302860 0.330271 0.214096 0.213074 0.219824 0.280740 0.231558 0.230480 0.232900 0.235088
chargesum: 0.00000
title: Mulliken charges with hydrogens summed into heavy atoms:
elementType: O N N C C C C C C C C C C C C C
charge: -0.286204 -0.194061 -0.117480 0.356707 0.376833 0.332922 0.073952 0.102883 -0.199862 -0.220638 -0.166485 -0.004254 -0.009547 0.019898 -0.018229 -0.046436
polarizability: 2.78196948e+02 3.72175482e+00 1.72316437e+02 2.71014940e-03 -4.84085287e-03 5.98469049e+01
1716.lowfreq: -21.6010 -2.5316 -2.1153 -0.0004 -0.0004 0.0009 16.6201 74.5243 128.3958
frequency: -19.3241 74.5205 128.3903 174.5531 231.3152 232.8872 271.1930 320.2692 327.5493 377.0234 423.1848 458.0164 460.1540 511.1157 539.4282 573.9676 595.2816 613.5025 639.2798 641.6329 659.7475 689.1596 712.1147 722.6740 747.8958 758.7837 777.9169 808.4244 843.4429 861.2370 862.9346 913.4948 917.3470 959.6515 967.3979 1000.0024 1040.8064 1057.2228 1083.9555 1127.7736 1135.3528 1174.6579 1176.1159 1220.2216 1224.6744 1254.9683 1285.5720 1295.5930 1354.7294 1393.1086 1398.4241 1414.1691 1434.8071 1459.4306 1485.4356 1514.4263 1537.5640 1577.7768 1600.0991 1615.9199 1622.5343 1630.1817 3105.5131 3106.3590 3115.6315 3141.7609 3150.2774 3155.0030 3173.3983 3173.6507 3488.1236 3524.5633
redmass: 4.9282 4.8690 5.3204 4.2610 4.0040 4.7208 4.3310 6.4035 7.2745 10.3328 3.4373 2.9810 8.1084 2.6110 3.4749 6.6002 1.3895 7.0451 2.3016 6.3772 6.5724 6.1603 3.3596 1.8384 1.4224 1.6071 1.9825 5.2203 1.4828 5.5056 1.5004 6.0638 1.3846 1.3126 1.3490 1.3367 3.1361 2.1039 3.0441 1.8495 1.7022 1.0774 1.1131 2.8832 1.9989 1.4523 1.5747 3.8263 3.2510 2.7085 4.0127 2.7181 2.4768 3.0813 2.7252 2.8806 2.5814 3.5194 5.0838 4.7066 4.7198 3.9306 1.0885 1.0889 1.0894 1.0892 1.0905 1.0918 1.1003 1.0999 1.0741 1.0746
irintensity: 0.0005 1.5410 0.1030 0.9180 4.4877 0.0040 3.9441 13.2621 3.3683 1.0466 3.7401 9.9193 2.0162 14.3511 0.0970 1.8161 27.1316 7.1508 0.7848 4.9776 8.6161 0.2760 0.7338 9.3291 84.9360 244.2610 0.0858 11.5999 0.5752 2.3847 2.8235 14.5365 7.5160 0.0394 2.5258 0.9371 6.0992 13.2172 2.1739 17.6580 36.1519 0.0270 3.7882 21.0426 8.5183 25.9647 1.9516 6.9119 85.7818 21.4885 53.6499 40.6617 16.4959 19.2340 120.8089 221.6470 350.0729 182.7240 116.3334 227.7677 206.3404 12.3097 9.5464 22.1762 8.1274 13.8171 12.0298 3.9704 35.5680 11.4243 27.8012 11.4268
temp: 298.150 k
press: 1.00000 atm
elementType: 8 7 7 6 6 6 6 6 6 6 6 6 6 6 6 6 1 1 1 1 1 1 1 1 1 1
symmnumber: 1
zpe: 526627.8 jmol-1
zpe.correction: 0.200582 hartree
zpe.thermalcorrener: 0.211589 hartree
zpe.thermalcorrenthalpy: 0.212533 hartree
zpe.thermalcorrgfe: 0.163931 hartree
zpe.sumelectzpe: -685.039562 hartree
zpe.sumelectthermal: -685.028555 hartree
zpe.sumelectthermalent: -685.027611 hartree
zpe.sumelectthermalfe: -685.076213 hartree
dipole: -1.8128 -3.9188 -0.0031
dipole: 4.3178
quadrupole: -80.1751 -87.2125 -99.3756
quadrupole: -8.2959 -0.0060 -0.0184
quadrupole: 8.7460 1.7086 -10.4545 -8.2959 -0.0060 -0.0184
hfenergy: -685.2401442 hartree
pointgroup: C01 [X(C13H10N2O1)]
dipole: 0.7093712 -1.5435521 0.0006566 debye
dipolederiv: -0.8202832 0.1533677 0.0001535 0.3884882 -1.1628337 -0.000203 -0.0009756 0.0010738 -0.3755889 -2.0847049 -0.0359561 0.0002203 -0.0613208 -0.1286496 0.0001409 0.000159 0.0001216 -0.3156036 -1.3791242 0.5556605 -0.0003101 0.2534487 -0.4750241 -0.0000975 -0.00011 -0.0004702 -0.320135 1.3622186 0.253963 -0.0000156 0.9592447 -0.0122152 -0.0002171 0.0004109 -0.0000328 0.0947511 1.6941268 -0.1962751 -0.0003553 -0.4628828 0.1433121 0.0001377 -0.0008652 -0.0002345 0.1394934 0.3289523 -0.4516973 -0.0003484 -0.9802308 0.4422599 0.0004391 -0.000378 0.0003793 0.0721769 -0.541726 -0.3183993 -0.0000904 0.1636824 -0.3662119 -0.0000168 -0.0001029 -0.0001081 -0.074747 1.8616396 -0.1701123 0.0005074 0.0269735 1.2526994 -0.0002088 0.0017638 -0.0008194 0.2604894 -0.3436006 -0.0673887 -0.0000748 0.1061903 0.1021078 0.0001753 0.000104 0.0002203 -0.2014781 -0.7245108 0.033909 0.0000834 -0.3165997 0.0625312 0.0001714 -0.0000994 0.0001776 -0.230499 -0.0209047 0.191356 0.0000127 0.0546799 0.0696349 0.0001936 0.000129 0.0000167 -0.1812751 0.2544797 0.2616523 0.0000984 -0.0894216 0.090046 0.0001731 0.0000069 0.0000903 -0.0779077 0.0265304 0.0271572 -0.0000398 -0.0586751 0.0092314 0.0001665 -0.0001377 0.0001021 -0.1659069 0.3176718 -0.0750174 -0.0000255 -0.0706896 0.2340703 0.0001764 -0.0000487 0.0001679 -0.1083393 -0.1148406 -0.0373528 -0.0000369 0.0845969 -0.0064933 0.0000554 0.000011 0.0001089 -0.1802639 -0.1090184 -0.1333562 -0.0000109 -0.0067642 -0.3362207 -0.0000745 0.0000394 -0.0000845 -0.2196348 0.1293011 0.0031573 0.0000258 -0.0089149 0.1026411 -0.000122 0.0000391 -0.0001323 0.2866441 0.105946 -0.0056132 0.0000467 0.00788 0.1604605 -0.0000033 -0.000033 0.0002882 0.2987907 0.0646149 -0.0961948 -0.0000304 -0.0436467 -0.1088601 -0.0001641 -0.0000229 -0.0001537 0.1609405 0.0374797 0.1088965 0.0000613 0.0480228 -0.1024488 -0.0001218 0.0001409 -0.0001413 0.1647261 0.0884081 0.0241899 0.0000256 -0.0363834 -0.1192823 -0.0001715 -0.0000182 -0.000183 0.1593257 0.1509632 0.0074761 0.0000019 0.0814902 0.0304398 -0.0001181 -0.0001223 -0.0000964 0.147841 -0.0432674 0.0964309 0.0001121 0.1206053 0.0007165 -0.0001382 0.0001554 -0.0001366 0.1677631 -0.0156862 -0.1056803 -0.0000468 -0.1325988 -0.0221263 -0.0000866 -0.0001077 -0.0000991 0.1527613 -0.1051418 -0.0584567 0.0000169 -0.0751161 0.0668317 -0.0000491 0.0000322 -0.0000254 0.1714558 -0.1195236 0.0342841 0.0000192 0.0479415 0.0733832 -0.0000366 0.00003 -0.0000291 0.1742202 unknown
polarizability: 278.1777836|-3.9849819|172.335585|-0.0153233|0.0422177|59.8469213 unknown
InChI: InChI=1S/C13H10N2O/c16-13-9-5-1-2-6-10(9)14-11-7-3-4-8-12(11)15-13/h1-8,14-15H
charge 0 multiplicity 1
26 atoms
O  -1.224682 2.889689 -0.00058
N  0.131971 -1.358248 -0.000169
N  0.681596 1.662545 0.001794
C  1.410822 -0.758852 0.000035
C  -1.182702 -0.867319 0.000337
C  1.669071 0.64199 0.00081
C  -1.589535 0.50405 0.001028
C  -0.71376 1.721153 0.001828
C  2.518703 -1.650022 -0.000869
C  -2.198005 -1.873915 -0.000169
C  3.017313 1.0873 0.000729
C  -2.981964 0.800196 0.000989
C  3.850908 -1.195574 -0.000916
C  -3.563539 -1.553247 -0.000086
C  4.105782 0.193588 -0.000078
C  -3.970338 -0.196483 0.000513
H  0.17622 -2.379394 -0.000856
H  1.061547 2.615832 0.001719
H  2.31828 -2.729914 -0.001569
H  -1.891124 -2.928583 -0.0007
H  3.207277 2.168555 0.001377
H  -3.248142 1.862076 0.001448
H  4.673862 -1.916946 -0.001633
H  -4.306905 -2.358023 -0.000522
H  5.130265 0.577732 -0.000079
H  -5.030919 0.071616 0.000621
