program: Gaussian 09
title: 000201345
version: EM64L-G09RevD.01
frameworkgroup: C1[X(C17H29NO4S)]
method: RPBEPBE
basis: SDD
operation: Freq
keyword: #p
keyword: freq=noraman
keyword: PBEPBE/SDD
title: #p freq=noraman PBEPBE/SDD
converged: YES YES NO NO
title: Mulliken charges:
elementType: S O O O O N C C C C C C C C C C C C C C C C C H H H H H H H H H H H H H H H H H H H H H H H H H H H H H
charge: 0.921941 -0.285912 -0.551564 -0.595558 -0.434629 -0.708584 -0.381090 -0.376225 -0.390508 -0.410175 -0.346921 -0.299059 -0.763623 -0.348602 0.425827 0.228252 -0.596621 -0.558260 -0.700703 -0.318566 -0.298374 0.536766 -0.428150 0.180938 0.188450 0.251558 0.184935 0.189804 0.190328 0.192648 0.207949 0.156600 0.239270 0.211325 0.208378 0.279444 0.274302 0.196902 0.186718 0.327952 0.245916 0.245821 0.220758 0.196653 0.217388 0.247649 0.197271 0.232864 0.219688 0.311624 0.305719 0.371484
chargesum: 0.00000
title: Mulliken charges with hydrogens summed into heavy atoms:
elementType: S O O O O N C C C C C C C C C C C C C C C C C
charge: 0.921941 -0.285912 -0.551564 -0.595558 -0.063145 -0.091242 -0.011702 0.060268 -0.010377 -0.009577 0.048949 0.120644 -0.209877 0.035018 0.425827 0.228252 -0.022753 -0.312438 -0.065904 -0.070918 0.131761 0.536766 -0.208462
polarizability: 3.11685244e+02 -1.82149074e+01 2.74200743e+02 -2.85562264e+01 2.58874979e+00 1.75445166e+02
1716.lowfreq: -11.6891 -9.1635 -4.4517 0.0016 0.0017 0.0018 1.3760 19.9205 30.3831
frequency: -10.0268 19.8386 30.3708 32.8386 42.0718 42.3839 50.8099 73.3628 85.9829 92.8668 106.5251 116.7905 117.6526 129.1818 151.2503 163.2492 177.5993 197.0159 204.3305 206.8932 217.0600 245.2775 250.1714 281.0181 292.8828 307.4846 320.2457 330.9852 331.4788 350.1509 357.8646 366.9570 388.6383 405.6187 430.7286 450.0213 472.3911 483.2086 487.3031 528.5136 546.9566 580.2072 621.9428 711.3081 724.7590 725.3336 733.0967 743.4824 753.1679 757.0663 778.6315 805.2907 819.8738 834.4914 858.6220 872.3207 874.8601 886.7312 905.6783 913.3430 921.0594 924.6401 931.9498 953.5047 958.8283 998.0073 999.9717 1037.4472 1038.9938 1041.0463 1049.8753 1072.6803 1073.5506 1099.3348 1101.9058 1121.1288 1139.1235 1141.9753 1146.0328 1173.9656 1180.2666 1185.0534 1198.3984 1211.3176 1221.9045 1228.4500 1253.2888 1256.7988 1267.6392 1281.5777 1284.0103 1289.8250 1293.0089 1306.6943 1331.8307 1335.3047 1340.8442 1348.4747 1359.0354 1366.9611 1370.2158 1384.8496 1391.4881 1394.5563 1416.8092 1425.4559 1450.3925 1455.4719 1456.6751 1462.4452 1463.1682 1468.9966 1473.7892 1478.8192 1482.1223 1485.8493 1492.1162 1505.1905 1582.2235 1636.0292 1648.9385 2929.6446 2936.5849 2945.1784 2953.8321 2955.6003 2964.3781 2965.4032 2966.0726 2975.8565 2994.4752 2999.3969 3009.6953 3016.3164 3029.5698 3033.2174 3033.8246 3041.9259 3058.4636 3060.3327 3067.9046 3069.1838 3126.9475 3133.0489 3134.2219 3166.3592 3167.5155 3247.1845 3570.5973 3710.0694
redmass: 4.9973 4.7806 3.2304 5.7617 7.2389 5.2180 4.8187 4.4801 2.2145 1.8524 2.6541 3.3123 2.7575 4.1985 4.5670 5.7882 5.2735 2.6686 1.9770 7.0402 3.4274 2.5277 1.1523 3.7238 3.2249 3.1012 3.3057 1.0987 4.2984 2.9160 1.4872 4.0312 2.6655 4.9300 3.3510 2.7238 3.2429 2.8613 3.1111 4.2985 4.4774 4.2771 3.9591 1.6478 1.1337 1.6387 1.9326 1.6517 3.2352 8.4696 1.3339 1.5402 1.6907 2.1589 2.7748 1.5919 1.7279 1.9097 1.8829 1.6615 1.8248 1.7863 2.8903 1.9758 2.4873 1.8045 1.7778 3.0105 1.6791 2.0065 1.8206 2.4681 2.1652 2.0907 1.2972 2.3603 1.4881 1.5495 1.4014 1.1975 1.5865 1.1771 1.7280 1.3187 1.3651 2.3110 1.2130 1.2992 1.2625 1.4001 1.3451 1.1837 1.0929 1.1236 1.4554 2.4010 1.4347 1.2401 1.5167 1.4004 1.5623 1.1911 1.1629 3.0279 1.4341 1.1607 1.0823 1.8230 1.5567 1.0787 1.0826 1.0648 1.1673 1.0444 1.0776 1.0868 1.0850 2.6540 7.3367 2.0760 1.8277 1.0691 1.0636 1.0595 1.0554 1.0615 1.0534 1.0455 1.0648 1.0622 1.0947 1.0946 1.1014 1.1045 1.1000 1.0747 1.1008 1.0747 1.0999 1.1004 1.0557 1.0992 1.0894 1.0919 1.1086 1.1126 1.0940 1.0668 1.0450 1.1039
irintensity: 1.5977 0.1725 0.5140 1.0515 0.9334 2.5805 12.1193 1.8379 0.9333 0.3402 0.7623 1.9565 1.2758 1.7995 3.4290 6.5425 5.2794 0.5702 0.5687 10.7428 14.6894 1.8698 0.0655 14.3914 4.4477 6.5468 19.4555 71.9943 32.0795 27.9208 141.2039 78.4465 0.0479 9.5831 3.2902 8.2433 20.6303 0.3147 4.2004 32.3953 3.7032 5.1878 1.5723 12.3688 145.1865 22.8109 10.3169 4.5715 11.5575 39.9498 1.0708 50.9604 8.1455 6.1534 40.6449 1.6693 25.1243 9.8854 26.4048 19.9830 12.6528 10.4415 84.9865 25.1633 14.6867 43.2827 9.0418 68.9333 3.9227 6.7845 24.9286 3.0226 12.1548 0.4703 14.4878 2.1741 6.3421 3.5070 20.0430 85.2166 2.1281 6.6557 38.2852 18.7124 1.7678 209.2941 17.3406 4.8752 1.2775 3.9096 2.7772 0.9749 2.5424 1.4531 3.0343 55.0623 0.3715 2.8670 2.6936 11.1626 3.3706 4.3918 21.9108 34.7982 15.5130 150.5257 6.8722 23.3557 22.3727 5.5109 0.4340 1.9163 78.3038 12.4760 10.0472 3.3118 28.8700 217.0794 34.3391 5.8044 214.8469 65.1188 16.6107 35.2815 40.6904 23.3430 103.4414 14.5873 17.7251 57.6047 26.1321 45.8778 5.5519 37.4563 20.4948 8.9040 68.4069 13.0529 65.3085 77.0170 12.6282 80.3099 18.2367 12.1381 4.0544 0.6935 14.2581 189.2081 81.7566 20.8909
temp: 298.150 k
press: 1.00000 atm
elementType: 16 8 8 8 8 7 6 6 6 6 6 6 6 6 6 6 6 6 6 6 6 6 6 1 1 1 1 1 1 1 1 1 1 1 1 1 1 1 1 1 1 1 1 1 1 1 1 1 1 1 1 1
symmnumber: 1
zpe: 1145067.2 jmol-1
zpe.correction: 0.436133 hartree
zpe.thermalcorrener: 0.462754 hartree
zpe.thermalcorrenthalpy: 0.463699 hartree
zpe.thermalcorrgfe: 0.377742 hartree
zpe.sumelectzpe: -1416.933537 hartree
zpe.sumelectthermal: -1416.906916 hartree
zpe.sumelectthermalent: -1416.905972 hartree
zpe.sumelectthermalfe: -1416.991928 hartree
dipole: 3.5777 -4.6620 2.7898
dipole: 6.5051
quadrupole: -122.3441 -158.8567 -147.3445
quadrupole: 4.9531 -12.4585 5.9284
quadrupole: 20.5044 -16.0083 -4.4961 4.9531 -12.4585 5.9284
hfenergy: -1417.3696702 hartree
pointgroup: C01 [X(C17H29N1O4S1)]
dipole: -1.4767433 -1.9053664 -0.8595973 debye
polarizability: 309.1812791|14.4063539|272.4303045|-36.196997|-11.7609787|179.71957 unknown
InChI: InChI=1S/C17H29NO4S/c1-2-3-4-5-6-7-11-22-17-9-8-16(18)13-15(17)14-23(20,21)12-10-19/h8-9,13,19H,2-7,10-12,14,18H2,1H3
charge 0 multiplicity 1
52 atoms
S  0.23174 1.822764 -0.129872
O  -1.059289 -1.715167 -0.743714
O  0.714221 0.801824 1.050753
O  -0.353362 3.32285 0.282573
O  1.495336 4.652647 -1.258134
N  -5.384529 1.264503 1.364374
C  3.132939 -2.865997 -0.483797
C  1.69915 -2.659786 0.054946
C  4.21891 -2.12629 0.336378
C  0.634157 -3.441676 -0.746009
C  4.107945 -0.583964 0.286784
C  -0.795635 -3.105205 -0.312685
C  -1.228541 0.988484 -1.331355
C  5.247937 0.129561 1.049246
C  -2.258274 0.349204 -0.496793
C  -2.16406 -1.046046 -0.199503
C  1.754687 2.186694 -1.306471
C  -3.333044 1.107573 0.030219
C  5.119414 1.668206 1.01773
C  -3.168002 -1.655529 0.587114
C  1.486765 3.47085 -2.102249
C  -4.330589 0.509166 0.842333
C  -4.232536 -0.888747 1.101354
H  3.179956 -2.52468 -1.540399
H  3.363528 -3.952167 -0.497965
H  1.434993 -1.586811 0.050787
H  1.662989 -2.979004 1.117952
H  4.167155 -2.459217 1.394301
H  5.220976 -2.42547 -0.035758
H  0.78731 -4.533468 -0.622249
H  0.735151 -3.227384 -1.828749
H  4.121751 -0.257154 -0.77683
H  3.136673 -0.256616 0.707508
H  -1.541586 -3.776178 -0.786394
H  -0.895786 -3.170629 0.790124
H  -0.638288 0.291623 -1.942316
H  -1.539748 1.902509 -1.856567
H  5.248061 -0.216763 2.102897
H  6.225721 -0.173653 0.621022
H  2.586418 2.296124 -0.59224
H  1.864935 1.271968 -1.913201
H  -3.37494 2.181533 -0.187176
H  4.164352 1.991245 1.474135
H  5.148509 2.049012 -0.022073
H  5.939694 2.157993 1.573957
H  -3.131679 -2.725585 0.809551
H  0.54147 3.380468 -2.68431
H  2.310336 3.604561 -2.827882
H  -4.997621 -1.379179 1.715493
H  -5.409846 2.272133 1.241169
H  -6.070679 0.841035 1.981257
H  0.787158 4.506737 -0.554967
