program: Gaussian 09
title: 000201284
version: EM64L-G09RevD.01
frameworkgroup: C1[X(C9H10N2O2)]
method: RPBEPBE
basis: SDD
operation: Freq
keyword: #p
keyword: freq=noraman
keyword: PBEPBE/SDD
title: #p freq=noraman PBEPBE/SDD
converged: NO NO NO NO
title: Mulliken charges:
elementType: O O N N C C C C C C C C C H H H H H H H H H H
charge: -0.247854 -0.183100 -0.177732 -0.074755 -0.052682 0.267446 0.096485 0.442213 -0.488130 -0.757601 -0.786223 -0.609646 0.136743 0.251958 0.228018 0.255888 0.228021 0.237036 0.239052 0.237035 0.251336 0.255225 0.251268
chargesum: 0.00000
title: Mulliken charges with hydrogens summed into heavy atoms:
elementType: O O N N C C C C C C C C C
charge: -0.247854 -0.183100 -0.177732 -0.074755 -0.052682 0.267446 0.096485 0.442213 -0.236172 -0.045674 -0.073101 0.148183 0.136743
polarizability: 1.65139420e+02 -1.88324332e+00 1.34729604e+02 -4.23610527e-03 -7.36010839e-03 6.14555274e+01
1716.lowfreq: -11.0594 -9.8880 -0.0009 -0.0008 -0.0007 4.4520 67.5679 75.6301 96.9442
frequency: 67.5641 75.6086 96.9283 122.7749 158.3589 183.6795 190.3762 207.1941 243.3789 255.1474 290.9035 372.6449 383.7393 424.3684 517.4638 537.4160 546.0625 598.0169 617.6098 623.6529 657.7873 677.0248 739.7799 745.2545 847.8248 899.8415 963.5342 991.9303 1016.1606 1036.7590 1046.0962 1095.0483 1106.2791 1128.6365 1195.2691 1219.2985 1249.7752 1357.7205 1392.0419 1396.8762 1410.1264 1433.5264 1453.8914 1457.3939 1464.5356 1469.7047 1469.7910 1475.7428 1483.1176 1533.0397 1551.4661 1584.8008 1718.5418 2982.7247 2984.8084 3008.5466 3060.8635 3063.1000 3101.8904 3103.0293 3105.2312 3128.0039 3168.2846
redmass: 1.2074 2.2577 1.1404 3.8850 1.1264 3.2847 3.4565 3.4262 2.6871 5.4619 3.0806 6.1145 6.0984 7.4732 5.2404 6.3947 4.0035 4.3465 4.9756 7.5407 4.4465 5.6962 9.1991 6.8090 1.3679 6.0436 2.2942 1.6556 2.3371 1.5251 1.5454 5.2628 3.1136 1.3105 2.6949 3.5889 1.9411 3.0951 1.2196 1.3588 3.1918 1.3831 1.5245 1.0466 1.0416 1.6663 1.0460 1.4630 1.3019 3.6354 7.7918 6.6015 11.6063 1.0377 1.0372 1.0331 1.0977 1.0969 1.1027 1.0991 1.0981 1.1018 1.0908
irintensity: 0.8086 2.1338 0.0506 3.2392 3.0379 5.8294 0.7074 0.0766 3.1169 0.0344 0.7556 1.4634 0.8213 3.4974 26.4594 17.8266 5.0961 37.5152 8.4490 0.0067 0.5747 28.7337 21.5225 3.2837 31.6258 2.0106 0.4771 20.4684 6.6051 1.9741 12.0207 6.9592 47.6560 0.9788 3.7216 11.7778 0.9450 11.0334 6.0747 41.2101 4.3906 33.7453 34.9645 2.9250 17.1813 12.8305 34.6257 31.7788 9.2087 18.3314 268.9433 211.4313 587.1765 4.7145 30.7695 37.8697 5.5226 24.6627 16.2139 32.6915 0.6692 4.3556 1.0676
temp: 298.150 k
press: 1.00000 atm
elementType: 8 8 7 7 6 6 6 6 6 6 6 6 6 1 1 1 1 1 1 1 1 1 1
symmnumber: 1
zpe: 463481.1 jmol-1
zpe.correction: 0.176531 hartree
zpe.thermalcorrener: 0.189087 hartree
zpe.thermalcorrenthalpy: 0.190031 hartree
zpe.thermalcorrgfe: 0.137789 hartree
zpe.sumelectzpe: -607.950104 hartree
zpe.sumelectthermal: -607.937547 hartree
zpe.sumelectthermalent: -607.936603 hartree
zpe.sumelectthermalfe: -607.988846 hartree
dipole: -3.2243 2.6627 0.0009
dipole: 4.1817
quadrupole: -92.7562 -61.6083 -76.2213
quadrupole: 7.3160 0.0023 -0.0013
quadrupole: -15.8943 15.2536 0.6407 7.3160 0.0023 -0.0013
hfenergy: -608.1266343 hartree
pointgroup: C01 [X(C9H10N2O2)]
dipole: -1.2681429 -1.0480856 0.0002098 debye
dipolederiv: -1.2481734 0.0291392 0.0000671 0.3031359 -0.4532359 0.0000871 0.0003211 0.0000107 -0.1760529 -1.4962508 -0.2972085 0.0004046 -0.5883552 -0.5711271 0.0002328 -0.000326 -0.000068 -0.3179907 -0.6374753 0.0164014 0.0000096 0.1816373 -0.5717585 0.0004584 0.0007496 -0.0010521 -0.1088692 -0.3289314 0.3465905 -0.0000025 0.4645088 -0.2147305 -0.0001803 -0.0001707 0.0000389 -0.2116999 -0.6768035 -0.0002099 0.0002365 0.4854719 -0.7252143 0.0001324 -0.0000583 0.0002098 -0.104497 0.758126 -0.1549095 -0.0000745 -0.3740991 0.6234149 -0.0000926 -0.0002466 0.0001728 0.1440736 0.8111813 0.1019912 -0.0003905 0.0367316 0.2336306 0.0000099 -0.0002914 -0.0000599 -0.0001314 1.1520282 -0.0266653 -0.000262 -0.2082161 0.6671529 -0.0001457 -0.000187 -0.0001705 0.0751651 -0.7614472 -0.1525956 0.0001917 -0.7414237 -0.4656914 0.0001629 0.0003544 0.0001065 -0.2419832 -0.0457299 -0.0481587 0.0000566 -0.1020898 -0.0766614 0.000065 0.0001165 0.0000267 0.0747486 0.0184109 -0.1530261 0.0000349 -0.0327189 -0.2262464 0.0001062 0.0001065 0.0001422 0.0339164 0.0927017 -0.085293 0.0002077 -0.2006617 0.5410254 -0.0008026 -0.000139 -0.000252 0.2037122 2.15516 0.187131 -0.000369 0.6076019 1.0103145 -0.000419 0.0000155 -0.0001137 0.2720716 0.0197521 0.0559357 0.0000066 0.0628137 0.0029884 0.0000612 -0.0000335 0.0001039 0.1770242 0.078898 0.0008515 -0.0625944 -0.0391216 -0.0155387 0.0930148 -0.0148635 0.1214309 -0.0388597 -0.0901628 0.0096892 0.0000835 0.1118285 0.0853285 -0.0000373 0.0000631 0.0000088 0.1213325 0.0789647 0.0007722 0.0624949 -0.0391782 -0.0156288 -0.0930038 0.014774 -0.1214366 -0.0388401 0.0480017 -0.0325951 0.1096259 -0.0262593 0.0477066 0.0083922 0.1024871 0.0498559 -0.0194068 -0.0790844 0.153832 0.0000366 0.0409629 0.0197905 0.0000024 0.0000514 -0.0000336 0.1137405 0.0478579 -0.0326862 -0.1096631 -0.0262939 0.0476804 -0.0084153 -0.1025306 -0.0498596 -0.0191872 0.0586263 0.0840596 0.0915295 0.0460078 -0.0019601 -0.0100654 0.092136 -0.0836785 -0.035827 -0.015355 -0.0864693 -0.000775 -0.0086447 0.0618312 0.0000055 -0.0005829 -0.0000603 0.1350288 0.0597053 0.0834236 -0.0908547 0.0463621 -0.0030708 0.0104311 -0.0917456 0.0846776 -0.0374683 unknown
polarizability: 165.1379807|1.8947964|134.7310306|-0.0188304|-0.027841|61.4555402 unknown
InChI: InChI=1S/C9H10N2O2/c1-5-4-7(12)13-9-8(5)6(2)10-11(9)3/h4H,1-3H3
charge 0 multiplicity 1
23 atoms
O  1.18746 1.336926 -0.001519
O  3.480629 0.886981 -0.001347
N  -1.21613 1.527848 -0.000684
N  -2.345738 0.675248 -0.000271
C  -0.398582 -0.578723 -0.000659
C  -0.060533 0.798524 -0.001017
C  -1.844623 -0.593909 -0.000204
C  0.675785 -1.535322 -0.000628
C  1.983368 -1.046754 -0.001016
C  -2.795823 -1.758161 0.000399
C  0.407265 -3.024016 -0.000061
C  -1.381603 2.979232 -0.001461
C  2.362182 0.352355 -0.001717
H  2.829756 -1.739576 -0.000786
H  -2.657429 -2.3964 0.892505
H  -3.831544 -1.381207 0.000757
H  -2.658168 -2.39671 -0.891602
H  -0.182102 -3.316762 0.888849
H  1.345824 -3.601262 -0.000279
H  -0.182885 -3.317325 -0.888262
H  -1.940058 3.297182 0.894296
H  -0.382933 3.442833 0.002362
H  -1.933119 3.297497 -0.901452
