program: Gaussian 09
title: 000201323
version: EM64L-G09RevD.01
frameworkgroup: C1[X(C21H24N2O3)]
method: RPBEPBE
basis: SDD
operation: Freq
keyword: #p
keyword: freq=noraman
keyword: PBEPBE/SDD
title: #p freq=noraman PBEPBE/SDD
converged: YES YES NO NO
title: Mulliken charges:
elementType: O O O N N C C C C C C C C C C C C C C C C C C C C C H H H H H H H H H H H H H H H H H H H H H H H H
charge: -0.285390 -0.203438 -0.196994 -0.220433 -0.714542 -0.377563 -0.391274 -0.339572 -0.407919 0.087800 0.083068 -0.300091 0.184522 0.190935 -0.356040 -0.357493 0.191575 0.406078 -0.211813 -0.211923 -0.510777 -0.329490 -0.626468 0.534647 -0.461450 -0.691408 0.238510 0.201533 0.238539 0.239852 0.194560 0.226942 0.211142 0.188257 0.199850 0.205988 0.269201 0.270203 0.237703 0.237810 0.196977 0.217920 0.239756 0.221733 0.212250 0.245469 0.208111 0.213064 0.299759 0.300322
chargesum: 0.00000
title: Mulliken charges with hydrogens summed into heavy atoms:
elementType: O O O N N C C C C C C C C C C C C C C C C C C C C C
charge: -0.285390 -0.203438 -0.196994 -0.220433 -0.114461 0.062480 0.087118 0.081930 -0.008519 0.087800 0.083068 0.105747 0.184522 0.190935 -0.086839 -0.087290 0.191575 0.406078 0.025890 0.025887 -0.095880 -0.089734 -0.404735 0.534647 -0.249199 -0.024764
polarizability: 2.42970810e+02 -1.37267489e+01 2.95892905e+02 4.35370962e+01 2.19106180e+00 2.01610356e+02
1716.lowfreq: -4.6395 -0.0005 0.0004 0.0006 1.9728 6.3620 9.9199 14.2450 17.4076
frequency: 9.2289 13.9489 16.8743 28.3628 34.9402 67.4204 72.6378 94.6278 107.6308 123.8898 137.1512 150.9727 155.1971 166.7658 174.1074 198.1678 208.6295 235.3979 247.9502 265.0737 279.3194 291.1047 299.7251 314.3986 322.9495 330.0264 343.1326 373.9389 409.2696 420.1647 440.5681 455.4552 461.0020 481.2436 520.9906 528.9456 538.3106 572.1013 586.6347 623.8913 658.9764 679.9104 690.2521 710.3651 711.9407 721.1753 738.8582 754.8906 785.0300 787.2972 793.1055 795.4056 819.5093 833.6750 869.5115 870.8157 900.9576 906.6770 906.9231 913.4631 924.2437 955.7123 974.1452 983.3599 993.8903 1005.7405 1013.9810 1021.8689 1039.5578 1049.6646 1064.2565 1072.5406 1075.6957 1088.3522 1099.9873 1128.6565 1142.4739 1166.5842 1170.8643 1182.9462 1185.9418 1203.6963 1209.9109 1213.3101 1246.7064 1269.2691 1273.5253 1282.5333 1283.1972 1296.6751 1310.6774 1312.5657 1333.8286 1336.9558 1354.1764 1362.1033 1366.9290 1373.1953 1382.1066 1390.8421 1416.3727 1449.4991 1450.7558 1452.0815 1453.7595 1457.0221 1463.0794 1465.2872 1472.2953 1477.1789 1481.2213 1490.9577 1504.4192 1591.7658 1615.4137 1617.7846 1626.7567 1632.1250 1643.7143 1675.7646 2937.2258 2973.1943 2975.8636 2979.3490 2981.3158 2986.2876 2997.2831 3011.3342 3025.5089 3035.5640 3038.9565 3060.9796 3072.5881 3078.0452 3094.9638 3106.4520 3121.5530 3138.6093 3152.5942 3158.9309 3164.4711 3174.1698 3574.2253 3715.2517
redmass: 5.0812 4.7556 6.4236 5.3354 5.3793 3.8277 3.0706 3.8327 2.3932 3.4261 4.9715 3.3203 3.2209 4.6754 4.9785 2.6026 1.4571 4.5871 2.3606 3.0261 1.2964 2.3448 2.6315 3.2025 1.0516 6.7861 4.2747 4.7689 3.0435 3.5274 4.2966 4.8913 3.1505 2.9751 5.1136 3.9577 3.6348 3.9028 7.9499 3.2534 4.8202 6.0036 5.4851 2.4916 3.5351 2.2790 2.9681 1.7723 4.4188 1.3113 1.5386 1.6187 2.6147 2.0520 2.8533 1.6431 1.7539 1.4247 2.0748 2.9261 2.4727 2.1820 1.4131 2.1997 3.7925 1.3445 2.1636 1.5120 2.0736 2.5182 2.1594 2.6448 1.4679 2.1796 2.6645 1.9802 1.8966 1.2383 2.0005 1.5682 1.5578 2.5842 2.1466 1.2755 1.3564 1.3576 1.2778 1.4604 1.4845 1.0845 1.4770 1.4085 2.5335 3.0045 1.3482 1.6531 1.4676 1.5809 1.2091 4.1004 6.0132 1.4414 1.1888 2.9933 2.4638 1.6603 1.0841 1.1220 1.0630 1.1650 1.0993 1.0779 2.4427 7.4431 7.7361 8.4259 10.6065 1.7187 2.2826 11.7249 1.0550 1.0637 1.0621 1.0364 1.0649 1.0584 1.1016 1.0609 1.0934 1.1004 1.1016 1.1029 1.0997 1.1046 1.1004 1.0909 1.0887 1.0864 1.0906 1.0937 1.0956 1.1003 1.0446 1.1040
irintensity: 0.1337 0.1926 0.0772 0.1839 1.4308 1.7067 0.3889 6.4462 0.2368 0.8682 0.0393 1.8476 7.6961 0.3817 0.1722 0.6629 0.6417 0.0943 0.4230 2.3038 256.0374 53.6167 4.9824 4.2909 2.0077 6.3185 4.7273 0.3728 2.0512 0.9251 5.9242 0.0188 3.9775 1.7994 7.2975 3.9676 1.5613 1.2917 3.2908 2.6268 0.0244 2.9724 2.9442 35.1242 63.8217 19.0560 0.4530 7.6219 0.1124 4.0588 58.0554 24.2202 2.6547 19.0359 6.9987 33.8918 1.5924 0.6518 11.6848 4.1146 22.3995 33.4510 2.5185 3.7373 38.7025 0.0038 9.6770 0.5583 31.2879 27.2822 19.4611 9.1911 2.0961 4.9371 1.4405 39.0856 10.8369 6.0219 4.7266 26.1174 5.9671 5.7243 217.0901 16.1525 17.1354 11.2212 0.8241 2.1135 0.4025 7.7763 3.0897 40.6412 21.8547 187.5709 3.0997 38.7786 16.8142 19.0058 13.7393 21.3528 8.5472 16.4776 4.1188 34.3250 11.6271 13.1512 6.8101 12.1730 8.9032 83.2370 12.5708 6.9572 178.2792 5.6266 1.7656 144.6905 278.2012 14.6284 199.6968 47.1377 46.6089 14.2757 3.3356 40.1429 54.2234 36.0246 67.1489 31.6772 20.7652 3.8372 11.5296 81.3453 57.4480 12.2263 25.2092 26.6452 29.0153 1.8840 5.7734 14.5448 5.7930 19.3262 61.0364 17.3375
temp: 298.150 k
press: 1.00000 atm
elementType: 8 8 8 7 7 6 6 6 6 6 6 6 6 6 6 6 6 6 6 6 6 6 6 6 6 6 1 1 1 1 1 1 1 1 1 1 1 1 1 1 1 1 1 1 1 1 1 1 1 1
symmnumber: 1
zpe: 1071169.3 jmol-1
zpe.correction: 0.407987 hartree
zpe.thermalcorrener: 0.433297 hartree
zpe.thermalcorrenthalpy: 0.434241 hartree
zpe.thermalcorrgfe: 0.348983 hartree
zpe.sumelectzpe: -1147.944331 hartree
zpe.sumelectthermal: -1147.919020 hartree
zpe.sumelectthermalent: -1147.918076 hartree
zpe.sumelectthermalfe: -1148.003334 hartree
dipole: 2.0204 -2.1682 0.3812
dipole: 2.9880
quadrupole: -136.7594 -121.1836 -166.9148
quadrupole: 3.7662 3.9721 1.4010
quadrupole: 4.8599 20.4357 -25.2956 3.7662 3.9721 1.4010
hfenergy: -1148.3523174 hartree
pointgroup: C01 [X(C21H24N2O3)]
dipole: 0.7217647 -0.9203802 0.1181798 debye
polarizability: 245.039736|-8.7389008|297.9069693|41.4950726|-1.5896641|197.5273658 unknown
InChI: InChI=1S/C21H24N2O3/c1-2-15-14-16(22)10-11-19(15)26-13-7-3-6-12-23-20(24)17-8-4-5-9-18(17)21(23)25/h4-5,8-11,14H,2-3,6-7,12-13,22H2,1H3
charge 0 multiplicity 1
50 atoms
O  2.07528 1.147292 -0.549697
O  -3.934279 1.30974 -1.608692
O  -2.211835 0.810821 2.747809
N  -3.012206 1.405553 0.583837
N  6.365167 -2.424761 0.411388
C  -1.628456 3.365911 -0.16903
C  -2.824236 2.863913 0.674911
C  -0.273093 2.763249 0.257119
C  0.889924 3.250311 -0.633969
C  -3.537857 0.740057 -0.560728
C  -2.673442 0.489266 1.624898
C  2.230492 2.587632 -0.30053
C  -3.515824 -0.721574 -0.224647
C  -2.998272 -0.87154 1.084946
C  -3.910506 -1.830558 -0.987109
C  -2.857711 -2.135412 1.676545
C  3.187801 0.310868 -0.286286
C  2.95659 -1.088343 -0.432323
C  -3.771609 -3.114932 -0.398446
C  -3.253166 -3.264963 0.912918
C  1.588962 -1.606942 -0.848715
C  4.461836 0.78583 0.097991
C  4.027619 -1.973873 -0.194155
C  5.322663 -1.514833 0.183912
C  5.52234 -0.117393 0.330405
C  1.307493 -1.4189 -2.363599
H  -1.823874 3.141331 -1.235199
H  -1.598126 4.470718 -0.077057
H  -2.670632 3.090648 1.745464
H  -3.756524 3.35063 0.33554
H  -0.066632 3.015741 1.317374
H  -0.315369 1.659829 0.199702
H  0.652297 3.048915 -1.697181
H  1.014266 4.348203 -0.533312
H  2.507145 2.753196 0.763156
H  3.038892 2.994128 -0.94442
H  -4.309258 -1.701917 -1.998218
H  -2.455392 -2.238385 2.689114
H  -4.067943 -4.005072 -0.963765
H  -3.15694 -4.268728 1.340587
H  1.511066 -2.680671 -0.591323
H  0.804654 -1.073738 -0.278465
H  4.647951 1.856807 0.222277
H  3.849403 -3.052382 -0.300747
H  6.50555 0.267116 0.628048
H  1.345354 -0.348685 -2.629462
H  0.304964 -1.805616 -2.626385
H  2.056594 -1.954417 -2.974936
H  7.286936 -2.100681 0.68567
H  6.216246 -3.422987 0.305687
