program: Gaussian 09
title: 000201321
version: EM64L-G09RevD.01
frameworkgroup: C1[X(C18H31NO2)]
method: RPBEPBE
basis: SDD
operation: Freq
keyword: #p
keyword: freq=noraman
keyword: PBEPBE/SDD
title: #p freq=noraman PBEPBE/SDD
converged: YES YES NO NO
title: Mulliken charges:
elementType: O O N C C C C C C C C C C C C C C C C C C H H H H H H H H H H H H H H H H H H H H H H H H H H H H H H H
charge: -0.279943 -0.275098 -0.713949 -0.372158 -0.367919 -0.365752 -0.354784 -0.421480 -0.354218 -0.298466 -0.696704 0.188204 0.392463 -0.406876 -0.328537 -0.606329 0.530212 -0.449897 -0.203055 -0.390036 -0.686195 0.182799 0.188906 0.191270 0.189717 0.185384 0.238260 0.185103 0.186713 0.211500 0.189613 0.194782 0.195336 0.204223 0.200618 0.214898 0.209400 0.209162 0.202529 0.186426 0.240205 0.224611 0.212836 0.174557 0.173033 0.214747 0.215521 0.205650 0.222086 0.208364 0.302106 0.300163
chargesum: 0.00000
title: Mulliken charges with hydrogens summed into heavy atoms:
elementType: O O N C C C C C C C C C C C C C C C C C C
charge: -0.279943 -0.275098 -0.111681 -0.000454 0.013068 0.057893 0.017032 -0.020367 0.035901 0.106374 -0.063244 0.188204 0.392463 -0.017922 -0.088331 -0.381719 0.530212 -0.237061 0.144535 0.040231 -0.050094
polarizability: 2.89216638e+02 -2.82698632e+00 2.14935996e+02 2.00231120e+01 5.70847644e+00 1.50838149e+02
1716.lowfreq: -21.9341 -5.6631 -0.0005 -0.0004 0.0005 4.8251 8.7564 14.2380 18.4774
frequency: -18.5020 14.0924 17.5688 35.7309 47.5064 51.1343 57.7211 64.1550 80.4615 91.0109 103.7531 114.8988 128.4622 138.1171 141.2433 153.3949 169.3124 202.9739 225.9542 228.5394 232.3431 244.3129 279.0489 292.1498 304.0320 321.9989 337.3414 346.8469 364.1616 365.2493 417.2550 457.6434 460.2409 478.8059 489.1765 551.6730 585.3843 637.2382 712.9179 719.8015 725.5625 736.1822 757.8149 764.1448 768.3467 798.9959 820.9278 864.5623 879.4724 888.2960 889.4886 898.5867 900.9059 908.3029 912.6258 937.3550 948.1881 984.5365 994.2640 1003.3179 1022.1396 1028.7851 1047.0321 1055.7108 1058.0934 1066.3948 1080.3758 1087.9808 1120.1665 1124.9355 1134.8412 1140.2656 1145.2511 1186.1851 1188.4329 1198.4188 1203.3792 1219.5513 1223.5498 1229.8812 1240.5590 1268.6232 1275.2056 1276.0551 1277.1668 1280.3677 1290.4935 1295.3173 1300.6733 1317.1259 1330.2649 1344.1823 1346.0836 1353.2593 1365.3075 1366.8083 1386.4302 1387.6614 1391.3752 1402.0664 1450.7526 1456.8252 1461.1885 1461.7912 1468.0295 1468.4381 1475.0776 1475.9816 1476.2235 1476.6735 1479.8402 1481.8509 1484.1535 1487.4456 1492.4162 1505.1026 1592.8571 1634.8117 1647.4618 2894.9987 2934.4735 2938.8693 2939.7803 2946.7239 2949.0379 2954.8223 2963.5436 2966.1763 2970.5074 2972.6570 2975.7765 2982.4354 2992.3602 2994.8475 2998.1643 2999.1690 3009.7352 3024.5550 3032.6507 3043.9803 3052.2205 3066.7339 3069.5405 3072.6233 3076.0073 3114.3864 3120.4950 3159.2272 3574.1078 3714.9193
redmass: 1.7705 3.9290 3.9378 3.4849 3.0945 2.6491 3.4233 2.3088 2.0029 3.2319 2.8342 2.6603 2.3253 2.5731 2.8846 4.0391 4.5213 2.8389 2.1307 1.1799 1.1477 3.6258 2.3882 1.2877 2.9260 1.0560 3.5639 3.4171 3.1048 5.4724 3.4638 2.8443 3.9283 3.3839 2.9897 3.7463 3.7411 4.4840 2.1079 1.1071 1.8300 1.5279 2.9956 1.0797 1.6842 1.5144 1.4462 1.8713 1.7429 1.1626 1.5665 1.7900 2.0170 2.8145 1.7393 2.1510 2.0754 1.7353 2.6673 1.4718 5.1984 3.5727 1.6404 2.7212 2.0685 2.6030 2.0699 2.0764 2.3735 2.2801 2.0986 1.4236 1.7254 1.6324 1.6153 1.1448 1.2696 2.1399 1.3404 1.3590 1.3046 1.2656 1.3287 1.2529 1.2090 1.0558 1.0971 1.1285 1.2752 1.3382 2.3487 1.4525 1.5031 1.6954 1.6030 1.4641 1.2203 1.7486 1.9803 1.5678 1.0863 3.1728 1.0686 1.0757 1.1271 1.1328 1.0974 1.0756 1.0430 1.1534 1.0512 1.0662 1.0844 1.0907 1.0872 2.5202 7.6433 1.4377 3.0942 1.0541 1.0590 1.0588 1.1005 1.0589 1.0588 1.0594 1.0625 1.0618 1.0361 1.0359 1.0649 1.0959 1.0987 1.1026 1.0608 1.1024 1.1011 1.0986 1.1040 1.1004 1.1027 1.1007 1.0993 1.1018 1.0991 1.0911 1.0889 1.0938 1.0447 1.1040
irintensity: 0.1017 0.1627 0.7116 0.1308 2.0041 2.1301 1.5671 0.1770 0.1208 0.2819 1.5418 0.6178 1.4608 0.7394 5.8092 1.4333 1.1911 0.5755 3.6029 0.5148 0.4289 5.0074 19.5853 294.2713 2.1887 4.7511 1.0144 2.8117 0.5050 0.6984 2.2341 0.0382 0.9024 3.1343 2.2193 1.6547 4.3115 8.2118 15.9181 10.0107 0.2423 6.4904 10.6551 8.3720 2.1534 45.3392 5.1295 56.6419 3.1491 0.6088 9.6958 5.6736 8.5836 1.7591 1.9234 12.8908 20.9636 18.6415 16.0020 2.8741 154.3596 8.2734 3.3196 12.0615 17.9462 6.4058 1.8393 7.0463 20.0378 16.6626 5.8748 0.2182 3.3858 24.9582 0.8676 6.8705 14.5414 220.7468 32.9405 2.4290 2.4705 0.9835 0.1279 0.4253 0.2582 1.2487 0.6682 3.1321 7.3474 0.4990 4.6931 44.8542 0.2373 0.9185 2.5155 13.8327 11.6565 16.6497 21.7607 6.5798 4.3484 57.9134 0.6082 0.0444 0.5674 2.7696 3.8696 1.5045 11.2787 88.9809 14.9142 3.3020 1.0991 29.6913 9.0691 202.7882 6.0702 46.4634 155.8089 67.5393 80.7572 68.9988 59.0341 4.0943 0.3343 20.2963 17.7482 126.8569 43.0503 39.4818 49.7793 2.1460 2.6379 29.0635 19.7217 69.5750 5.0807 30.0201 51.2646 0.3714 118.1941 104.5210 47.8232 97.0365 47.1633 18.7372 32.5817 15.0399 65.5269 18.0674
temp: 298.150 k
press: 1.00000 atm
elementType: 8 8 7 6 6 6 6 6 6 6 6 6 6 6 6 6 6 6 6 6 6 1 1 1 1 1 1 1 1 1 1 1 1 1 1 1 1 1 1 1 1 1 1 1 1 1 1 1 1 1 1 1
symmnumber: 1
zpe: 1196770.3 jmol-1
zpe.correction: 0.455826 hartree
zpe.thermalcorrener: 0.480589 hartree
zpe.thermalcorrenthalpy: 0.481534 hartree
zpe.thermalcorrgfe: 0.398321 hartree
zpe.sumelectzpe: -908.020180 hartree
zpe.sumelectthermal: -907.995417 hartree
zpe.sumelectthermalent: -907.994472 hartree
zpe.sumelectthermalfe: -908.077685 hartree
dipole: -1.3552 -0.4589 0.0304
dipole: 1.4311
quadrupole: -108.5836 -118.4445 -131.8656
quadrupole: -3.3277 6.2054 5.1100
quadrupole: 11.0476 1.1867 -12.2343 -3.3277 6.2054 5.1100
hfenergy: -908.4760059 hartree
pointgroup: C01 [X(C18H31N1O2)]
dipole: -0.5368624 -0.1696333 0.0025034 debye
polarizability: 289.3801555|-5.9450398|213.7938638|18.5773148|10.51094|151.8167631 unknown
InChI: InChI=1S/C18H31NO2/c1-3-5-6-7-8-9-13-21-18-11-10-17(19)14-16(18)15-20-12-4-2/h10-11,14H,3-9,12-13,15,19H2,1-2H3
charge 0 multiplicity 1
52 atoms
O  -1.307645 -1.275663 0.553224
O  -0.757132 1.9105 0.24108
N  -6.285061 1.099769 -0.725532
C  2.960333 -1.864921 0.084134
C  3.866117 -0.789579 -0.557465
C  1.479826 -1.734004 -0.335863
C  5.348221 -0.896123 -0.133526
C  0.562509 -2.779697 0.3360
C  6.240297 0.205868 -0.749879
C  -0.918235 -2.58019 -0.003977
C  7.721293 0.090542 -0.328307
C  -2.561421 -0.744572 0.189769
C  -2.791705 0.61242 0.555914
C  -1.710666 1.400987 1.255071
C  -3.570413 -1.473091 -0.479864
C  -4.03355 1.203391 0.251332
C  -5.059866 0.486813 -0.427751
C  -4.806074 -0.863116 -0.788179
C  0.483706 2.400532 0.852864
C  1.402519 2.877071 -0.277391
C  2.755821 3.401087 0.251096
H  3.338667 -2.873599 -0.186318
H  3.034535 -1.791887 1.189841
H  3.794859 -0.861223 -1.663092
H  3.480877 0.216872 -0.28874
H  1.399907 -1.830463 -1.439154
H  1.105521 -0.723244 -0.084258
H  5.743603 -1.892211 -0.424073
H  5.418796 -0.845725 0.973575
H  0.681773 -2.730705 1.436473
H  0.856595 -3.803275 0.024946
H  5.84543 1.199885 -0.453928
H  6.164273 0.159469 -1.855575
H  -1.545536 -3.380792 0.442509
H  -1.075124 -2.575319 -1.103733
H  8.336551 0.889645 -0.781584
H  7.827225 0.164289 0.770735
H  8.146559 -0.882137 -0.640516
H  -1.164241 0.751833 1.97014
H  -2.146867 2.26055 1.809606
H  -3.411955 -2.518019 -0.762963
H  -4.200873 2.251048 0.533499
H  -5.577868 -1.441986 -1.310491
H  0.970001 1.582487 1.434303
H  0.266446 3.236466 1.558958
H  0.880473 3.667648 -0.848439
H  1.563233 2.033735 -0.97568
H  3.302525 2.614308 0.805745
H  3.401499 3.735387 -0.58087
H  2.616432 4.259849 0.934988
H  -6.446225 2.075527 -0.497829
H  -7.009465 0.596066 -1.227027
