program: Gaussian 09
title: 000017096
version: EM64L-G09RevD.01
frameworkgroup: C1[X(C12H13N)]
method: RPBEPBE
basis: SDD
operation: Freq
keyword: #pfreq=noraman
keyword: PBEPBE/SDD
title: #p freq=noraman PBEPBE/SDD
converged: NO YES NO NO
title: Mulliken charges:
elementType: N C C C C C C C C C C C C H H H H H H H H H H H H H
charge: -0.047010 0.268081 0.282503 0.167225 -0.083568 -0.001589 -0.847978 -0.380795 -0.868170 -0.326315 -0.806437 -0.259918 -0.230757 0.240466 0.254066 0.240570 0.239512 0.237894 0.238007 0.255735 0.261067 0.262111 0.225711 0.225693 0.224558 0.229338
chargesum: 0.00000
title: Mulliken charges with hydrogens summed into heavy atoms:
elementType: N C C C C C C C C C C C C
charge: -0.047010 0.268081 0.282503 0.167225 -0.083568 -0.001589 -0.112876 -0.141283 -0.136533 -0.065249 -0.092921 -0.035360 -0.001419
polarizability: 2.05069019e+02 8.31956376e-01 1.45161212e+02 4.70096903e-03 -1.21639124e-03 6.75687960e+01
1716.lowfreq: -6.8128 -0.0003 0.0004 0.0004 2.5609 6.1589 76.2966 98.2151 121.8287
frequency: 76.2590 98.2103 121.8245 148.6677 169.1414 224.8743 263.9645 300.9125 312.8916 318.9660 355.7943 438.6269 447.5662 449.3588 522.5230 539.6329 546.2515 561.1041 642.0649 668.4777 682.8605 769.7431 794.0680 805.9733 845.1353 879.9669 948.1500 963.2985 993.1276 1005.7244 1013.9205 1021.4138 1040.5230 1052.4957 1065.0397 1082.4761 1105.8522 1155.2358 1184.0116 1243.3827 1284.3515 1321.1840 1366.4058 1383.2994 1384.8936 1394.9449 1403.5110 1420.2423 1443.3935 1457.1153 1464.1065 1466.9748 1478.9627 1493.7082 1500.6903 1502.9320 1555.1729 1581.3486 1620.2904 2975.4050 2977.9153 2979.7343 3047.5898 3049.0329 3051.4146 3111.1251 3116.5526 3118.0479 3124.9695 3138.1994 3153.9647 3167.7818
redmass: 1.5366 2.3939 2.0573 1.3530 1.7031 1.0747 3.4591 4.3876 3.1882 2.6185 2.6426 5.5876 5.2088 3.0963 4.8274 3.3695 3.4055 3.3775 5.6730 5.5833 3.4307 1.3119 2.9555 2.9057 4.6088 1.6620 2.2577 1.3610 1.3196 1.6574 1.3889 2.1924 1.5437 1.7032 2.1284 1.8610 2.2887 1.4305 1.4913 2.5875 2.2446 3.4285 6.0026 2.5158 1.4726 1.2696 1.1953 4.1814 2.3189 1.3305 1.0477 1.2195 1.0464 1.1290 1.0460 2.4618 6.6623 6.2176 6.4043 1.0386 1.0407 1.0406 1.0973 1.0969 1.0972 1.0949 1.0968 1.0942 1.0849 1.0893 1.0955 1.0995
irintensity: 0.2006 0.2590 3.0483 3.0379 0.7137 0.1645 1.8872 0.3307 0.5205 1.6248 0.0666 0.1412 2.0055 3.8738 1.0671 0.1915 2.9470 1.7549 3.9014 0.6101 0.3526 96.0001 0.7990 4.1117 1.7003 0.8399 1.3104 2.5025 0.3429 12.6790 6.1629 7.0623 0.1443 0.1320 3.4459 11.4782 0.5388 8.3054 4.6661 4.9223 1.5690 1.2928 28.1180 22.3461 22.2392 13.2431 13.7726 20.2312 2.4373 1.6311 37.7457 15.2097 0.2094 11.5765 0.4070 36.1912 6.7456 32.2527 1.7512 24.5714 32.5687 21.2030 29.1271 3.8857 21.3230 21.4554 15.4178 11.1429 0.7984 11.1366 29.8230 25.2062
temp: 298.150 k
press: 1.00000 atm
elementType: 7 6 6 6 6 6 6 6 6 6 6 6 6 1 1 1 1 1 1 1 1 1 1 1 1 1
symmnumber: 1
zpe: 564606.1 jmol-1
zpe.correction: 0.215047 hartree
zpe.thermalcorrener: 0.226796 hartree
zpe.thermalcorrenthalpy: 0.227740 hartree
zpe.thermalcorrgfe: 0.177919 hartree
zpe.sumelectzpe: -518.918223 hartree
zpe.sumelectthermal: -518.906474 hartree
zpe.sumelectthermalent: -518.905530 hartree
zpe.sumelectthermalfe: -518.955351 hartree
dipole: -0.9582 2.6643 0.0007
dipole: 2.8314
quadrupole: -65.1288 -74.1426 -80.9502
quadrupole: -0.6853 0.0013 -0.0005
quadrupole: 8.2784 -0.7354 -7.5430 -0.6853 0.0013 -0.0005
hfenergy: -519.1332697 hartree
pointgroup: C01 [X(C12H13N1)]
dipole: 0.3838831 -1.0457259 0.0002717 debye
dipolederiv: -0.5378887 -0.0231763 0.0000615 0.0606951 -0.3841014 0.0000609 0.0001377 0.0000683 -0.2550839 0.0898523 0.0950563 0.0000286 -0.0831943 0.4241445 0.0000632 0.0000297 -0.0004053 -0.0496771 -0.0421828 0.0130184 -0.0000582 0.062166 -0.280386 -0.0000811 -0.0001022 -0.0000455 0.0284362 0.130355 -0.2590073 0.0000536 -0.4546699 -0.3268664 -0.0000158 -0.0004919 -0.0000348 -0.0173574 0.2794672 0.0730784 0.0000182 -0.041811 0.0104787 0.0000136 -0.0001231 0.0000303 0.0658122 0.4590278 0.1783267 -0.0001382 0.432077 0.4789892 -0.0000219 0.0001401 0.0000846 0.0115592 0.0292278 -0.0566501 -0.0000616 0.0130431 -0.1967802 -0.0000018 -0.0002134 0.0006948 0.0535391 -0.0305435 0.0333744 -0.0000082 0.0494553 0.0652754 -0.0001218 0.0001079 -0.0001269 -0.1688622 -0.1113446 0.080517 -0.0000574 0.1747588 -0.0025976 -0.0000296 0.0010205 -0.000035 0.0707857 -0.0523076 -0.0098383 -0.0000113 -0.0404525 0.1194414 -0.0000168 0.0000161 0.000045 -0.1613601 -0.2377024 -0.1533817 -0.0000477 -0.1196342 -0.0694673 0.0000021 -0.0004695 -0.0002034 0.0624354 -0.0243883 0.0996922 -0.0000807 0.1471424 0.0559421 0.0000207 -0.0000759 -0.0000641 -0.1616388 0.0092504 -0.1164245 -0.0000417 -0.1600494 0.0052541 -0.0000039 -0.0000156 0.0000457 -0.1644846 0.0543825 -0.0654362 -0.0948581 -0.0172622 0.0179391 -0.0428713 -0.0723991 -0.0838881 -0.0320857 -0.1017887 0.1405516 0.0008779 0.0483098 0.0705271 -0.0000687 0.000703 -0.0003609 0.0960742 0.0557239 -0.0646003 0.0939855 -0.0169085 0.0172662 0.0432111 0.0717831 0.0842268 -0.033242 0.0888647 0.0203565 0.0000068 -0.0341157 -0.1139693 0.0000397 -0.0000267 0.0000466 0.1462709 0.0149597 0.0222095 0.0012113 0.0743103 0.0099552 0.1053806 -0.0581761 0.1126243 -0.0398546 0.0142675 0.0228741 -0.0004109 0.0745389 0.0117785 -0.1046385 0.0588465 -0.1121955 -0.0412035 -0.0312871 -0.0771297 -0.0005107 -0.1708982 0.0123416 -0.0008474 -0.0009631 -0.0005708 0.0963787 0.0959269 -0.0204677 0.000015 0.0408787 -0.0667778 -0.0000093 0.0000113 -0.0000136 0.1573312 0.1037316 0.1152448 -0.0001635 -0.0026198 -0.0794679 0.0003051 0.0000397 0.0003868 0.1130767 -0.0304772 -0.0252437 -0.0944861 -0.012768 0.0783438 0.0585148 -0.1322593 0.0193723 -0.0483372 -0.0306741 -0.0249048 0.0945956 -0.0123449 0.078113 -0.0588945 0.132377 -0.0196884 -0.0477869 -0.0910958 -0.0939071 0.0000452 -0.1075689 0.0243019 0.0000213 0.000054 0.0000208 0.1593052 -0.1033564 0.0958677 0.0000354 0.0969219 0.0403221 -0.0000107 0.0000494 -0.000014 0.1599694 unknown
polarizability: 205.0554578|1.2265428|145.1747734|-0.0047089|0.0011854|67.568796 unknown
InChI: InChI=1S/C12H13N/c1-8-9(2)11-6-4-5-7-12(11)13-10(8)3/h4-7H,1-3H3
charge 0 multiplicity 1
26 atoms
N  0.447619 1.650019 -0.000291
C  0.659811 -1.214503 -0.000387
C  -0.639399 -0.582406 -0.000291
C  1.81269 -0.402297 0.000146
C  -0.693799 0.863585 -0.000184
C  1.65248 1.040795 -0.000109
C  0.742555 -2.730268 -0.000904
C  -1.874272 -1.31137 -0.000136
C  3.206017 -1.014565 0.000671
C  -1.963018 1.525584 -0.000023
C  2.850084 1.974905 -0.000334
C  -3.102163 -0.642872 0.000099
C  -3.148707 0.78684 0.000126
H  0.234796 -3.155341 -0.887654
H  1.781326 -3.091311 -0.004776
H  0.241265 -3.155637 0.889443
H  -1.857042 -2.406536 -0.000019
H  3.368042 -1.655215 0.888226
H  3.371662 -1.648406 -0.891176
H  3.990324 -0.243307 0.005196
H  -1.960774 2.620061 0.000012
H  2.480063 3.011284 -0.002085
H  3.488538 1.827679 0.891631
H  3.490346 1.825106 -0.890543
H  -4.036688 -1.215419 0.000296
H  -4.117156 1.299594 0.000268
