program: Gaussian 09
title: 000201293
version: EM64L-G09RevD.01
frameworkgroup: C1[X(C18H19NO2)]
method: RPBEPBE
basis: SDD
operation: Freq
keyword: #p
keyword: freq=noraman
keyword: PBEPBE/SDD
title: #p freq=noraman PBEPBE/SDD
converged: YES YES NO NO
title: Mulliken charges:
elementType: O O N C C C C C C C C C C C C C C C C C C H H H H H H H H H H H H H H H H H H H
charge: -0.267227 -0.259896 -0.060749 -0.394779 -0.480385 0.016967 -0.493791 0.498944 0.376554 -0.424697 -0.364779 -0.381644 -0.376184 -0.358929 -0.364659 0.312105 -0.375532 -0.357892 0.316078 -0.538399 -0.538043 0.235928 0.234889 0.228005 0.235453 0.223579 0.234650 0.245359 0.243246 0.281960 0.248155 0.239375 0.239050 0.250349 0.221332 0.244361 0.220648 0.222046 0.222706 0.245846
chargesum: 0.00000
title: Mulliken charges with hydrogens summed into heavy atoms:
elementType: O O N C C C C C C C C C C C C C C C C C C
charge: -0.267227 -0.259896 -0.060749 -0.158851 -0.017491 0.016967 -0.034759 0.498944 0.376554 -0.190047 -0.119419 -0.138398 -0.094225 -0.110774 -0.125284 0.312105 -0.136482 -0.107544 0.316078 0.147942 0.152555
polarizability: 2.47217498e+02 1.38790803e+01 2.31752968e+02 4.76099234e+00 -1.46465301e+01 1.68872956e+02
1716.lowfreq: -7.6376 -1.7743 0.0003 0.0006 0.0008 9.3917 23.4373 33.0214 34.8152
frequency: 23.3897 32.9167 34.7693 65.4853 82.3960 90.6021 115.6053 123.0861 141.2304 187.5596 201.3245 223.1350 241.0065 241.6471 252.6902 273.4808 297.8252 324.9463 388.6880 413.9478 414.3912 435.6444 442.8083 472.0943 500.7992 519.9266 544.4061 591.7750 620.1799 632.7582 639.6303 667.6823 728.6592 742.8895 756.3046 769.4250 791.0583 811.8643 819.1319 834.8243 844.9529 855.8814 873.7047 915.3689 944.1140 944.3116 958.2379 962.2575 981.3772 988.0231 992.1845 994.9491 1001.6495 1008.2203 1031.0152 1056.1826 1111.3367 1111.9320 1113.5852 1113.7704 1146.1147 1155.2337 1157.6016 1174.5791 1179.9128 1183.6875 1197.6153 1230.2353 1232.4354 1235.5468 1266.0076 1282.7434 1298.4972 1303.1573 1313.6885 1323.3547 1373.6719 1382.5404 1419.3192 1428.5264 1436.5261 1437.0915 1457.3610 1466.6278 1467.0453 1467.9268 1472.9923 1474.4864 1500.1631 1503.5862 1559.9107 1581.6449 1587.4800 1621.7954 1622.2567 2957.9877 2960.9763 2983.6026 3002.1933 3018.0151 3045.1669 3049.4895 3050.8638 3088.2497 3117.4316 3123.8920 3125.9866 3128.0176 3142.3940 3152.1673 3159.6404 3164.4861 3165.0802 3172.6591
redmass: 5.1153 3.5601 3.5487 3.7043 3.5508 3.8477 3.8792 4.0861 3.5339 3.4932 2.1678 2.1011 2.1028 1.8334 1.6401 3.4962 4.2010 4.4800 5.2848 2.9641 2.9873 4.2631 4.9681 3.9736 3.7142 2.8599 2.5548 5.3989 5.8465 6.9422 5.5285 2.3137 3.9555 3.7020 4.5493 5.7803 3.7306 1.3732 1.3077 1.6306 1.9459 1.7487 4.1390 3.1854 1.3890 1.3980 3.9931 1.3639 5.6924 8.3101 5.7761 1.3511 2.8388 2.4869 2.1937 2.4353 1.3535 1.2607 1.3278 1.2607 1.2473 1.3249 1.3340 1.2055 1.2788 1.2530 1.6691 2.9225 2.8735 1.3622 1.8742 1.6978 1.3803 1.3041 1.3684 2.4064 5.5585 4.3910 3.1835 3.7151 1.2013 1.1700 1.1017 1.0502 1.1159 1.0501 1.0774 1.0795 2.3798 2.6378 7.0394 7.1183 7.3702 6.2864 6.3330 1.0330 1.0329 1.0652 1.0741 1.0753 1.1038 1.1040 1.0959 1.1032 1.0895 1.0988 1.0995 1.0893 1.0876 1.0879 1.0938 1.0950 1.0952 1.0974
irintensity: 0.2848 1.3209 1.4848 1.7280 1.6522 1.9163 2.9014 3.3605 1.3388 4.1418 6.3152 0.7582 5.6520 4.2151 1.7880 0.4994 0.7292 1.1361 3.1679 0.3782 0.2764 0.1752 1.7146 2.2231 1.4201 23.7329 36.0708 12.6040 3.6601 3.2503 5.0652 20.8773 1.3244 5.4925 6.6863 7.1569 4.5248 19.9441 9.1884 53.5472 8.0378 49.7682 0.5801 2.7695 0.4406 0.9772 14.8537 0.1642 38.5606 45.8361 19.6074 0.6714 13.1819 14.6486 10.4838 2.9807 13.8001 0.3267 8.1297 0.2520 5.3987 6.5403 0.5048 4.2635 108.2171 84.7128 11.0868 154.2608 154.8132 28.3519 10.1146 8.3485 10.5275 0.5451 4.6703 109.7496 9.4075 10.9259 0.4379 44.7246 4.3420 10.4625 6.7185 13.7047 3.7295 13.9469 44.6789 60.5931 120.3104 101.2790 78.3467 2.9418 23.0721 127.0343 50.7540 66.3723 72.3668 52.3061 17.6145 31.4426 47.8638 45.7233 43.5768 38.5789 15.3887 32.5018 27.9078 4.0778 10.2688 1.4053 13.4087 7.2058 12.9708 6.6320
temp: 298.150 k
press: 1.00000 atm
elementType: 8 8 7 6 6 6 6 6 6 6 6 6 6 6 6 6 6 6 6 6 6 1 1 1 1 1 1 1 1 1 1 1 1 1 1 1 1 1 1 1
symmnumber: 1
zpe: 854401.1 jmol-1
zpe.correction: 0.325424 hartree
zpe.thermalcorrener: 0.344555 hartree
zpe.thermalcorrenthalpy: 0.345500 hartree
zpe.thermalcorrgfe: 0.276355 hartree
zpe.sumelectzpe: -900.963451 hartree
zpe.sumelectthermal: -900.944320 hartree
zpe.sumelectthermalent: -900.943376 hartree
zpe.sumelectthermalfe: -901.012520 hartree
dipole: 1.1319 -2.3613 0.9427
dipole: 2.7831
quadrupole: -119.5992 -114.4700 -115.9035
quadrupole: 8.7991 -13.6451 3.5952
quadrupole: -2.9417 2.1876 0.7541 8.7991 -13.6451 3.5952
hfenergy: -901.2888753 hartree
pointgroup: C01 [X(C18H19N1O2)]
dipole: -0.4656296 0.9217036 0.3640666 debye
polarizability: 247.1610646|13.6047886|231.8010374|-2.4436704|15.4967991|168.881319 unknown
InChI: InChI=1S/C18H19NO2/c1-20-15-7-3-13(4-8-15)17-11-12-19-18(17)14-5-9-16(21-2)10-6-14/h3-10,17H,11-12H2,1-2H3
charge 0 multiplicity 1
40 atoms
O  -4.478889 2.420924 -0.188339
O  4.923726 1.877966 -0.165182
N  0.525331 -2.825869 -0.906405
C  -0.635028 -1.755866 0.92327
C  -1.248052 -3.186338 0.739288
C  0.564516 -1.823235 -0.050917
C  -0.697645 -3.642334 -0.646699
C  -1.612877 -0.626365 0.584463
C  1.662617 -0.834436 -0.054423
C  -2.314622 0.047391 1.620684
C  -1.88842 -0.252367 -0.752725
C  1.666616 0.282002 0.820297
C  2.764541 -0.996978 -0.946183
C  -3.25782 1.051488 1.336252
C  -2.832752 0.753048 -1.060226
C  -3.522152 1.407466 -0.009911
C  2.728281 1.212672 0.819224
C  3.825423 -0.083138 -0.958719
C  3.813405 1.028102 -0.072785
C  -4.786067 2.823257 -1.562383
C  4.967396 3.037979 0.72895
H  -0.291425 -1.614061 1.965128
H  -2.349319 -3.180867 0.788636
H  -0.868467 -3.857519 1.531439
H  -0.435439 -4.714728 -0.676488
H  -1.421096 -3.461719 -1.467158
H  -2.121572 -0.222163 2.666851
H  -1.348064 -0.740637 -1.572532
H  0.82438 0.44445 1.500888
H  2.758494 -1.859121 -1.620024
H  -3.798726 1.572039 2.132619
H  -3.013702 1.017606 -2.106471
H  2.696699 2.065133 1.504186
H  4.675883 -0.201409 -1.637081
H  -3.891511 3.22926 -2.074065
H  -5.547931 3.610987 -1.467914
H  -5.195264 1.977293 -2.148825
H  4.970854 2.726535 1.791625
H  4.114825 3.720164 0.544861
H  5.910747 3.549887 0.489197
