program: Gaussian 09
title: 000201272
version: EM64L-G09RevD.01
frameworkgroup: C1[X(C14H18N2O)]
method: RPBEPBE
basis: SDD
operation: Freq
keyword: #p
keyword: freq=noraman
keyword: PBEPBE/SDD
title: #p freq=noraman PBEPBE/SDD
converged: YES YES NO NO
title: Mulliken charges:
elementType: O N N C C C C C C C C C C C C C C H H H H H H H H H H H H H H H H H H
charge: -0.273341 -0.340996 -0.490446 -0.162716 0.212710 0.146891 -0.473372 -0.439865 0.186340 -0.400836 0.183862 -0.583649 -0.680557 -0.343116 0.308722 -0.353639 -0.537102 0.209074 0.200348 0.225798 0.192284 0.212467 0.259086 0.204686 0.177490 0.296245 0.245247 0.242104 0.228231 0.200612 0.229419 0.244987 0.216011 0.217034 0.239984
chargesum: 0.00000
title: Mulliken charges with hydrogens summed into heavy atoms:
elementType: O N N C C C C C C C C C C C C C C
charge: -0.273341 -0.081910 -0.194201 0.046359 0.212710 0.146891 -0.047225 -0.035114 0.186340 -0.018661 0.183862 -0.338402 -0.009608 -0.113697 0.308722 -0.108651 0.135928
polarizability: 2.42666058e+02 -6.85494180e-01 1.69539971e+02 -8.42902506e+00 7.88425358e+00 1.03003811e+02
1716.lowfreq: -6.1874 -3.0653 -0.0008 -0.0007 0.0004 5.0225 46.7429 61.7390 85.3854
frequency: 46.7017 61.7300 85.3637 114.0926 127.8440 145.4395 174.4889 200.0567 215.4814 238.6264 253.5104 288.1911 295.3231 335.5932 364.7973 382.5254 426.4052 436.6615 450.7239 469.3283 487.3990 522.2439 548.8148 581.9771 617.3302 620.8983 662.9808 707.7707 746.3662 754.8631 785.4047 792.5064 798.8661 824.7412 840.6915 871.1676 896.7931 913.5748 928.2241 967.1584 993.0763 998.2738 1049.1555 1053.9529 1080.7249 1090.0353 1113.8776 1119.6286 1144.7943 1155.6222 1161.5051 1186.1707 1194.0120 1217.1580 1227.0571 1247.3412 1251.2190 1270.8062 1283.6643 1298.9988 1317.2452 1335.3841 1350.9069 1381.4099 1386.7285 1410.6268 1429.7145 1437.0751 1452.3574 1457.0773 1463.3462 1468.4098 1470.3631 1472.8798 1476.2203 1478.3314 1485.9934 1492.8514 1581.7681 1601.3985 1633.4614 2794.0179 2868.8237 2948.6347 2962.7784 2968.3031 2987.6836 3008.9285 3018.7334 3031.4195 3040.2546 3078.4793 3096.6630 3116.1841 3132.7305 3155.5164 3170.6202 3456.4727 3611.2635
redmass: 3.5979 3.3507 3.1782 3.0543 3.3813 3.1568 1.9536 1.6240 2.4986 2.2259 1.4437 2.5501 2.8180 2.7390 4.4391 5.7471 2.7635 4.4392 3.2419 1.2697 2.1902 4.3877 3.5698 3.0900 2.3154 3.2099 5.7410 2.8410 3.4233 3.5560 1.2406 4.6734 1.5673 4.1843 1.7214 2.4169 2.3338 2.7722 1.3343 2.1252 3.6234 2.5459 1.6669 1.7881 2.4239 2.2039 1.2622 1.3446 2.0415 1.9919 2.1987 1.3483 2.0829 1.4116 1.4000 1.8507 1.2156 1.5362 1.6517 1.4953 2.3631 1.9261 1.3637 1.6027 1.2336 3.5609 1.3991 1.4598 1.7204 1.3358 1.0507 1.0527 1.3252 1.1451 1.2414 2.5146 2.5793 1.0767 7.3262 6.6508 7.2000 1.0792 1.0712 1.0334 1.0599 1.0593 1.0368 1.1001 1.1006 1.1033 1.0905 1.0999 1.0996 1.0986 1.0895 1.0907 1.0951 1.0750 1.0802
irintensity: 0.9476 0.2847 4.9948 0.3950 0.6977 4.8924 1.0225 0.3025 1.9823 3.7511 0.1396 1.2882 1.4579 1.3271 3.0860 1.2361 1.0516 1.0691 19.1652 48.4079 82.5924 12.0699 7.1590 15.7913 22.3919 30.4666 2.1724 4.8671 0.5907 11.9122 15.4749 21.6372 40.6271 4.0164 37.5881 0.1766 0.9544 17.3232 0.0331 4.1628 18.4402 26.1299 21.7167 14.3779 8.2070 1.8083 0.2120 4.4792 67.8370 13.2676 14.2713 23.8435 110.1918 15.4228 4.9504 15.7747 3.0931 17.5513 1.2551 23.1943 24.1395 19.9189 3.1229 25.6684 18.3429 42.2689 17.2436 5.9183 29.8655 61.2063 12.2079 6.8772 18.6013 6.6241 1.0421 80.0818 2.3884 14.5514 7.0669 37.8871 36.5871 97.7396 117.9652 64.1036 69.7071 41.0888 30.3459 43.7135 35.5321 57.1471 64.2744 60.6553 24.7000 33.4386 12.9068 10.0107 8.9656 2.1644 43.1237
temp: 298.150 k
press: 1.00000 atm
elementType: 8 7 7 6 6 6 6 6 6 6 6 6 6 6 6 6 6 1 1 1 1 1 1 1 1 1 1 1 1 1 1 1 1 1 1
symmnumber: 1
zpe: 772493.2 jmol-1
zpe.correction: 0.294227 hartree
zpe.thermalcorrener: 0.309901 hartree
zpe.thermalcorrenthalpy: 0.310846 hartree
zpe.thermalcorrgfe: 0.251859 hartree
zpe.sumelectzpe: -727.744119 hartree
zpe.sumelectthermal: -727.728445 hartree
zpe.sumelectthermalent: -727.727501 hartree
zpe.sumelectthermalfe: -727.786488 hartree
dipole: 2.8134 0.7064 -0.9550
dipole: 3.0539
quadrupole: -94.3271 -87.1541 -105.8488
quadrupole: -8.4354 -6.2730 3.0333
quadrupole: 1.4495 8.6226 -10.0721 -8.4354 -6.2730 3.0333
hfenergy: -728.0383465 hartree
pointgroup: C01 [X(C14H18N2O1)]
dipole: -1.1158267 0.229837 0.3817502 debye
polarizability: 242.4591252|3.6044964|169.9068758|-8.4402662|-7.3373089|102.8438394 unknown
InChI: InChI=1S/C14H18N2O/c1-3-12-14-10(6-7-15-12)11-8-9(17-2)4-5-13(11)16-14/h4-5,8,12,15-16H,3,6-7H2,1-2H3
charge 0 multiplicity 1
35 atoms
O  4.441709 0.319084 -0.294832
N  -3.40077 1.178709 0.075048
N  -0.786495 -1.478575 0.561192
C  -3.012945 -0.178695 0.542007
C  -1.51272 -0.287348 0.411514
C  -0.634755 0.760799 0.137201
C  -1.12779 2.17428 -0.051184
C  -2.545706 2.289442 0.561124
C  0.701726 0.202462 0.101079
C  -3.785971 -1.258871 -0.269759
C  0.578251 -1.206148 0.371405
C  1.989194 0.763326 -0.128142
C  -3.452736 -1.269616 -1.775164
C  1.703179 -2.057843 0.415231
C  3.107096 -0.095206 -0.083855
C  2.968828 -1.491299 0.184623
C  4.660377 1.733962 -0.582093
H  -3.280828 -0.329608 1.623437
H  -0.454104 2.903785 0.44113
H  -1.171151 2.438548 -1.126582
H  -2.450114 2.298099 1.67568
H  -3.016804 3.241808 0.2565
H  -4.400804 1.351954 0.236652
H  -4.871478 -1.079014 -0.125314
H  -3.584341 -2.254839 0.177798
H  -1.18689 -2.395707 0.742818
H  2.093117 1.832511 -0.335137
H  -3.629666 -0.270605 -2.208351
H  -2.391276 -1.523929 -1.94681
H  -4.076032 -2.007326 -2.312999
H  1.608213 -3.12977 0.621157
H  3.876197 -2.102071 0.204495
H  4.325715 2.37544 0.257857
H  4.138988 2.044933 -1.509616
H  5.747488 1.839331 -0.716404
