program: Gaussian 09
title: 000201296
version: EM64L-G09RevD.01
frameworkgroup: C1[X(C20H25NO3)]
method: RPBEPBE
basis: SDD
operation: Freq
keyword: #p
keyword: freq=noraman
keyword: PBEPBE/SDD
title: #p freq=noraman PBEPBE/SDD
converged: YES YES NO NO
title: Mulliken charges:
elementType: O O O N C C C C C C C C C C C C C C C C C C C C H H H H H H H H H H H H H H H H H H H H H H H H H
charge: -0.246061 -0.423796 -0.201762 -0.091439 0.152255 -0.509772 -0.414726 -0.434531 0.386488 -0.339249 -0.350133 0.057729 0.150799 -0.723759 -0.324464 -0.318263 -0.401846 0.403784 -0.283955 -0.351270 -0.467095 -0.438766 -0.309097 -0.247575 0.253952 0.229134 0.213625 0.219630 0.234275 0.231072 0.215327 0.194133 0.189467 0.210155 0.219072 0.240257 0.215738 0.215666 0.192094 0.191638 0.213312 0.251979 0.227241 0.255681 0.239982 0.238460 0.377376 0.227473 0.229765
chargesum: 0.00000
title: Mulliken charges with hydrogens summed into heavy atoms:
elementType: O O O N C C C C C C C C C C C C C C C C C C C C
charge: -0.246061 -0.046420 -0.201762 -0.091439 0.152255 -0.026686 0.018530 0.030816 0.386488 0.070211 0.049489 0.057729 0.150799 -0.048693 0.083296 0.086687 -0.149867 0.403784 -0.056714 -0.095589 -0.227113 -0.200307 -0.081623 -0.017810
polarizability: 2.98786238e+02 1.06331704e+01 2.33505421e+02 1.60184852e+01 6.48787961e-01 1.63824259e+02
1716.lowfreq: -17.2801 -9.3222 -6.2553 -3.7141 -0.0006 -0.0005 0.0010 27.8364 36.5399
frequency: -11.2080 27.6314 36.5243 49.1801 63.4255 77.0270 89.9377 102.5349 131.7531 155.8291 165.3230 169.3728 178.2547 200.0440 232.9975 242.4330 261.8656 268.9445 307.8654 315.8624 330.9167 355.4099 386.1219 405.7525 415.1775 429.5227 436.0081 468.0022 471.0164 480.3724 505.1622 523.1620 536.2300 574.8373 595.1167 601.8096 635.0237 656.2953 661.5229 730.1145 742.9275 748.4420 764.8515 782.4018 788.0178 794.5355 801.1089 814.0837 818.4794 840.4468 871.6902 882.2705 893.6258 912.3131 935.9274 965.6242 973.7417 987.0618 994.5621 998.2172 1005.5769 1018.1442 1027.1215 1035.7964 1043.1145 1052.0971 1063.4018 1079.3683 1087.5777 1096.8610 1110.9919 1122.4497 1134.8710 1146.3079 1153.8564 1162.3407 1179.4076 1184.5360 1191.4997 1219.4960 1232.4244 1238.6868 1256.0326 1270.3227 1277.6010 1284.6631 1286.0224 1293.7523 1308.4857 1312.2799 1333.1961 1337.6399 1345.8636 1361.7918 1365.9618 1370.7187 1389.8565 1391.9856 1402.1784 1413.5170 1441.6024 1441.8723 1446.7304 1451.1842 1455.5540 1458.8812 1465.1470 1472.7408 1477.4099 1483.1701 1493.3161 1518.2755 1587.8906 1603.1307 1631.9900 1642.5771 2860.3540 2861.6446 2875.7063 2953.9063 2958.4367 2983.0270 3014.6196 3019.2353 3023.1772 3027.0139 3043.5408 3061.4478 3077.2857 3079.6190 3083.4551 3084.1427 3088.7397 3121.0054 3124.3680 3133.2796 3148.5224 3156.3074 3176.8267 3178.5401 3495.6453
redmass: 3.6365 4.3313 4.9221 4.1508 3.5454 8.0849 3.0191 4.3613 3.7030 4.0448 5.0661 1.8995 3.9013 3.0679 2.0191 1.9056 3.1027 3.3066 2.4325 2.6043 2.7437 3.9013 2.2554 4.2224 3.0103 3.6933 4.4430 2.8495 3.3040 4.2875 4.7574 5.3971 3.4354 3.6519 2.0878 2.8063 1.5601 3.2373 3.8602 3.9735 1.8627 1.2687 2.9043 3.2376 1.9367 3.0073 2.1882 1.9888 1.7842 1.6038 2.0402 2.1456 2.5610 1.6963 1.9642 1.4204 2.1734 1.3934 1.3907 2.6501 2.7917 2.5125 2.1855 2.6647 2.7521 2.0794 2.9103 2.6534 2.6983 2.3471 2.6181 2.2419 2.5245 2.1994 1.6407 2.5725 1.2376 1.2403 1.0676 1.2912 1.9337 1.6924 1.4577 1.3799 1.6130 1.5616 1.3626 1.3176 1.3399 1.2347 1.2560 1.3608 1.2687 1.4007 2.3213 1.2632 1.2067 1.4120 2.7629 4.2475 1.0842 2.3776 1.0848 1.0975 1.5442 1.1852 1.2517 1.0683 1.0876 1.0612 1.0719 3.5682 7.2529 5.1163 6.3464 8.7124 1.0696 1.0710 1.0688 1.0663 1.0664 1.0357 1.0657 1.0636 1.0827 1.0863 1.0888 1.0991 1.0988 1.0964 1.0978 1.1019 1.1014 1.0863 1.0865 1.0902 1.0955 1.0972 1.0947 1.0933 1.0637
irintensity: 0.0775 0.0156 0.1312 0.3387 0.2992 0.9521 0.4973 1.3204 0.1381 0.8313 1.1177 0.5440 2.2118 0.1755 3.8733 0.7789 2.4973 3.1545 4.5843 1.3947 7.2888 4.2599 0.9347 7.2479 1.1464 3.3522 6.3071 0.3024 0.3226 6.4684 4.9943 7.1269 9.6455 9.3964 11.5583 8.6964 119.6686 6.8841 17.6620 45.1600 13.9591 4.6889 11.1989 1.9186 69.6218 6.1373 1.2582 50.5374 33.5581 0.6042 5.6221 6.3831 9.4080 3.6256 1.2849 6.1070 15.9045 1.7337 2.4771 30.9371 32.6826 144.0603 12.0374 21.6235 11.3615 18.3428 1.7631 15.7522 13.7132 21.3127 13.1277 45.9913 53.9795 10.7479 1.5370 7.1104 0.5809 1.0988 1.2345 9.9659 4.6579 2.7059 11.2984 1.4694 4.8285 14.2596 8.5344 3.4638 3.9393 12.1782 8.8075 0.9253 15.2488 3.2377 10.3221 3.5864 20.2661 7.2348 4.5588 4.0056 2.8263 7.6914 2.1285 18.6647 0.7144 5.0496 5.8507 10.4778 7.7790 10.5972 0.4426 9.9212 3.3529 6.8824 2.3175 151.8759 51.0558 34.1400 146.5359 38.8032 92.7691 28.6750 10.5563 2.3224 12.7504 56.5561 35.1103 3.0445 42.2508 43.3985 35.2026 25.7423 55.4351 0.8146 2.5637 16.3720 29.8339 36.6069 14.1474 8.6471 25.4540
temp: 298.150 k
press: 1.00000 atm
elementType: 8 8 8 7 6 6 6 6 6 6 6 6 6 6 6 6 6 6 6 6 6 6 6 6 1 1 1 1 1 1 1 1 1 1 1 1 1 1 1 1 1 1 1 1 1 1 1 1 1
symmnumber: 1
zpe: 1075884.4 jmol-1
zpe.correction: 0.409783 hartree
zpe.thermalcorrener: 0.431366 hartree
zpe.thermalcorrenthalpy: 0.432310 hartree
zpe.thermalcorrgfe: 0.359283 hartree
zpe.sumelectzpe: -1055.739833 hartree
zpe.sumelectthermal: -1055.718250 hartree
zpe.sumelectthermalent: -1055.717305 hartree
zpe.sumelectthermalfe: -1055.790333 hartree
dipole: -1.5353 -0.9360 1.9283
dipole: 2.6366
quadrupole: -149.8192 -129.0517 -148.2465
quadrupole: -2.5584 6.9014 1.5031
quadrupole: -7.4467 13.3208 -5.8741 -2.5584 6.9014 1.5031
hfenergy: -1056.1496154 hartree
pointgroup: C01 [X(C20H25N1O3)]
dipole: -0.5998096 0.4812571 -0.6961419 debye
polarizability: 298.7855036|-8.4794682|231.8234203|-17.0475872|11.0466327|165.5069949 unknown
InChI: InChI=1S/C20H25NO3/c1-2-20(19(22)23,10-11-21-12-14-24-15-13-21)18-9-5-7-16-6-3-4-8-17(16)18/h3-9,22H,2,10-15H2,1H3
charge 0 multiplicity 1
49 atoms
O  6.412515 -0.629808 0.602057
O  -0.140528 2.670147 0.945023
O  -0.11565 0.724525 2.193345
N  3.691274 -0.013863 -0.221418
C  -0.192002 0.516889 -0.282528
C  1.206639 -0.201701 -0.320958
C  2.422578 0.750091 -0.316018
C  -0.34531 1.481793 -1.511871
C  -1.360313 -0.513933 -0.253983
C  3.997217 -0.465269 1.162556
C  4.854887 0.723368 -0.780024
C  -0.16923 1.265693 1.068381
C  -2.730406 -0.099435 0.00882
C  -0.210023 0.781029 -2.880801
C  5.254813 -1.349007 1.161201
C  6.099569 -0.179457 -0.764226
C  -1.117329 -1.866439 -0.528065
C  -3.789912 -1.094618 -0.032016
C  -2.161835 -2.839415 -0.568295
C  -3.113114 1.252139 0.320913
C  -3.47857 -2.461434 -0.326689
C  -5.146437 -0.707571 0.229635
C  -4.44202 1.599101 0.574249
C  -5.475385 0.614106 0.527589
H  1.26196 -0.88129 0.54832
H  1.282341 -0.819812 -1.231008
H  2.338029 1.501244 0.508884
H  2.446103 1.321352 -1.262849
H  -1.331422 1.97425 -1.463521
H  0.401375 2.290782 -1.425718
H  3.145622 -1.044176 1.563356
H  4.163427 0.409376 1.841441
H  5.07532 1.654172 -0.198205
H  4.628298 1.016348 -1.822892
H  -0.423454 1.499605 -3.692854
H  -0.921551 -0.058369 -2.977501
H  0.80796 0.384911 -3.050489
H  5.548021 -1.624828 2.187575
H  5.061789 -2.267718 0.566276
H  5.924452 -1.060937 -1.418459
H  6.99382 0.367015 -1.107119
H  -0.099389 -2.212975 -0.717077
H  -1.912895 -3.883056 -0.788734
H  -2.358427 2.04038 0.370169
H  -4.290475 -3.197801 -0.353105
H  -5.924748 -1.479439 0.193455
H  -0.082543 3.061189 1.860065
H  -4.694809 2.638449 0.811796
H  -6.514034 0.898795 0.727515
