program: Gaussian 09
title: 000201322
version: EM64L-G09RevD.01
frameworkgroup: C1[X(C22H32N2O3)]
method: RPBEPBE
basis: SDD
operation: Freq
keyword: #p
keyword: freq=noraman
keyword: PBEPBE/SDD
title: #p freq=noraman PBEPBE/SDD
converged: YES YES NO NO
title: Mulliken charges:
elementType: O O O N N C C C C C C C C C C C C C C C C C C C C C C H H H H H H H H H H H H H H H H H H H H H H H H H H H H H H H H
charge: -0.296490 -0.292846 -0.280340 -0.711160 -0.712166 -0.371221 -0.368730 -0.353108 -0.356074 -0.400060 -0.354928 -0.296767 -0.695998 0.110837 0.349176 -0.473752 -0.324338 -0.548667 0.535973 -0.431336 0.200831 0.256398 -0.273712 -0.554760 0.555760 -0.462938 -0.546575 0.192909 0.183059 0.183544 0.185714 0.225510 0.180585 0.188586 0.187567 0.189257 0.211489 0.195248 0.191999 0.193073 0.207340 0.214848 0.210309 0.209799 0.219117 0.272396 0.236149 0.241356 0.214518 0.300960 0.304377 0.222280 0.228259 0.214314 0.299057 0.302773 0.219851 0.217408 0.253341
chargesum: 0.00000
title: Mulliken charges with hydrogens summed into heavy atoms:
elementType: O O O N N C C C C C C C C C C C C C C C C C C C C C C
charge: -0.296490 -0.292846 -0.280340 -0.105823 -0.110336 0.004747 0.000528 0.052986 0.020078 0.000687 0.032319 0.103646 -0.061042 0.110837 0.349176 0.017762 -0.088189 -0.307311 0.535973 -0.216818 0.200831 0.256398 -0.051432 -0.326502 0.555760 -0.248624 0.144025
polarizability: 3.46703032e+02 1.85237932e+00 2.65255270e+02 3.23160877e+00 -1.03281723e+01 2.00034689e+02
1716.lowfreq: -22.2345 -5.7665 -3.1290 -0.0013 -0.0006 0.0007 7.7212 8.5952 13.5136
frequency: -21.2828 6.6845 12.7000 23.5088 27.5002 40.9304 49.0614 52.4756 76.2291 84.9048 91.3672 99.0016 102.1233 117.7843 123.8152 137.8432 157.3242 191.5377 199.8207 202.3551 209.6992 222.2300 229.2729 261.7757 272.5991 282.6719 295.0702 298.7802 308.2754 317.6891 331.9401 336.3084 352.9767 355.2574 370.6098 388.4477 404.9555 438.0818 445.0770 456.5371 463.8799 480.1636 517.9865 530.1098 542.8776 552.6867 576.9679 603.4393 623.1063 700.9760 705.2960 715.8709 719.1475 720.6237 729.7224 737.0820 750.8831 775.3769 792.5676 811.3489 822.4942 824.2554 872.8156 874.6399 880.5908 894.4945 915.6558 921.0028 929.0418 931.1389 936.9436 944.0729 987.7751 997.2199 1003.5862 1007.9750 1026.6445 1039.5466 1044.4365 1053.2219 1067.0291 1080.7346 1090.7749 1098.7355 1107.0626 1113.4015 1123.4813 1143.0889 1149.1937 1159.3552 1169.0169 1188.2352 1189.8274 1199.1783 1203.6503 1227.2905 1233.3403 1239.7980 1257.3912 1260.6779 1268.2069 1276.6929 1278.1915 1289.0061 1291.9026 1315.0693 1325.2089 1328.1847 1333.7340 1347.0975 1352.7588 1366.5185 1367.7016 1379.1488 1383.3181 1386.0899 1425.0886 1444.8864 1447.3567 1453.4108 1459.6516 1460.6280 1467.1163 1468.1004 1472.0463 1473.9122 1474.9426 1475.7505 1480.6825 1483.0936 1487.1506 1492.1655 1506.5146 1582.7862 1588.4549 1628.0892 1629.4988 1641.1770 1641.7456 2936.3866 2943.3408 2949.1278 2954.4034 2955.0025 2960.2661 2965.2694 2971.0089 2971.6725 2981.2697 2994.0448 2995.4932 3009.2071 3011.1875 3023.8014 3032.2726 3040.7698 3052.3669 3067.7090 3069.6934 3087.5069 3119.0057 3124.4996 3124.7106 3128.0498 3142.5020 3151.6767 3163.1393 3570.8565 3574.2408 3712.0740 3715.1241
redmass: 1.7227 4.3505 4.3944 4.5737 4.2755 4.2098 3.3597 4.1012 3.4067 2.0929 3.6868 3.2136 3.1888 2.6853 3.8827 1.9591 4.7841 4.2754 2.0336 2.5859 3.4298 1.1464 2.4271 2.4307 1.5957 3.9156 1.3493 3.0689 4.8234 1.2562 1.1413 3.0999 2.9853 1.0884 3.1248 5.0930 4.8323 3.1266 3.3765 2.9046 3.3338 3.8589 4.3192 6.3092 4.3477 4.3472 3.4062 4.1922 3.0589 2.4864 4.4411 3.2295 2.6061 1.2025 1.2383 4.3221 1.8451 1.6424 1.5485 1.4519 1.8147 2.1083 1.7376 1.9045 1.7093 1.8230 1.9447 2.7391 1.6956 2.9275 1.4471 2.9647 2.2837 3.7527 1.5676 1.8509 3.3485 1.5599 1.5413 2.1378 2.6243 2.0664 2.0083 2.3678 2.1869 1.2583 2.6802 1.6678 1.4169 1.5133 1.7904 1.8529 1.9634 1.7459 1.2873 1.3382 1.3696 1.3104 1.4613 1.3946 1.2600 1.2244 1.0450 1.0935 1.1358 1.3574 2.2150 3.1729 1.7716 1.5079 1.7050 1.6679 1.3697 6.5593 4.5571 1.2177 1.6863 2.8317 1.1064 1.9609 1.0761 1.0774 1.0763 1.0554 1.1284 1.1024 1.0681 1.0618 1.2993 1.0869 1.0915 2.2685 3.0540 7.3770 7.5435 3.0884 2.7969 1.4918 1.4629 1.0564 1.0589 1.0593 1.0591 1.0339 1.0646 1.0595 1.0369 1.0650 1.0967 1.0995 1.1009 1.1005 1.0605 1.0983 1.1043 1.1038 1.1024 1.1007 1.0993 1.1027 1.0883 1.0984 1.0904 1.0889 1.0899 1.0958 1.0952 1.0447 1.0447 1.1041 1.1040
irintensity: 0.2047 0.2449 0.2255 1.6720 0.4601 0.5136 1.4534 2.3685 1.4204 0.3758 1.1799 5.9851 1.6730 1.3038 2.5581 0.0411 2.1633 3.1089 1.1384 0.6950 0.8074 0.0822 1.3069 6.7817 12.2021 18.5519 237.8632 9.9045 8.6554 271.8892 31.5634 14.5672 0.4578 11.2093 6.5327 3.8350 3.2779 10.0753 6.0925 0.0803 1.1872 2.0127 5.3176 4.5397 0.6154 1.4919 13.5053 4.8252 12.1120 7.0064 1.9921 0.3751 3.3354 13.7667 1.3830 13.7276 1.4105 1.9827 19.8862 31.0100 13.1187 76.2574 20.1346 6.9475 52.4478 5.4621 40.9273 7.6194 11.4885 66.1269 7.0995 7.5801 16.2298 34.8252 1.3686 1.9729 5.4695 8.4800 5.0715 26.1032 3.3731 1.7388 5.6776 15.4202 94.7106 0.4218 8.2187 2.2052 8.6534 22.0871 44.7124 74.9886 107.0236 171.8331 5.6196 3.5993 11.2500 0.6434 2.9305 5.5603 0.4630 0.2042 0.7290 0.7631 2.3298 0.2765 31.1690 5.0606 41.7708 0.1302 0.6555 0.0341 30.3692 24.1336 5.1785 11.5591 3.9958 13.7148 4.2920 29.4825 4.4927 0.2762 1.7075 17.8251 29.6579 25.9549 17.9276 3.6637 91.6939 13.6067 32.0263 109.5850 202.6780 9.0579 35.3261 34.8807 16.4577 257.1962 248.1196 40.8488 7.2483 4.1877 16.8541 59.4813 21.8617 135.9668 34.6998 60.9793 3.1406 3.1630 77.0667 7.6952 35.4141 24.9442 44.6550 45.2508 118.1240 94.7669 53.6385 2.4407 19.5417 22.3539 20.6326 15.6703 19.2659 15.5085 11.6590 64.7970 63.0128 18.3792 17.5232
temp: 298.150 k
press: 1.00000 atm
elementType: 8 8 8 7 7 6 6 6 6 6 6 6 6 6 6 6 6 6 6 6 6 6 6 6 6 6 6 1 1 1 1 1 1 1 1 1 1 1 1 1 1 1 1 1 1 1 1 1 1 1 1 1 1 1 1 1 1 1 1
symmnumber: 1
zpe: 1310538.4 jmol-1
zpe.correction: 0.499158 hartree
zpe.thermalcorrener: 0.528572 hartree
zpe.thermalcorrenthalpy: 0.529516 hartree
zpe.thermalcorrgfe: 0.435166 hartree
zpe.sumelectzpe: -1190.615593 hartree
zpe.sumelectthermal: -1190.586179 hartree
zpe.sumelectthermalent: -1190.585235 hartree
zpe.sumelectthermalfe: -1190.679585 hartree
dipole: -0.4152 0.7705 -2.1662
dipole: 2.3363
quadrupole: -130.5604 -140.9498 -165.2385
quadrupole: 3.8626 5.0695 -12.6438
quadrupole: 15.0225 4.6331 -19.6556 3.8626 5.0695 -12.6438
hfenergy: -1191.1147511 hartree
pointgroup: C01 [X(C22H32N2O3)]
dipole: -0.0189747 0.3181342 -0.8621448 debye
polarizability: 325.1538775|-36.3798569|285.6717997|-7.5226031|-11.3234817|201.1673136 unknown
InChI: InChI=1S/C22H32N2O3/c1-3-4-5-6-7-8-13-26-20-11-9-18(23)14-17(20)16-27-21-12-10-19(24)15-22(21)25-2/h9-12,14-15H,3-8,13,16,23-24H2,1-2H3
charge 0 multiplicity 1
59 atoms
O  -1.343896 -1.590664 -0.521355
O  -1.080891 1.798881 2.019425
O  1.437915 1.315228 0.85947
N  -5.98004 1.540835 0.389683
N  0.976797 5.426597 -1.82551
C  2.571457 -3.615819 -0.210472
C  3.884168 -2.849794 0.069188
C  1.303984 -2.819028 0.17122
C  5.155571 -3.663177 -0.261965
C  0.000408 -3.587465 -0.13801
C  6.466053 -2.890224 0.011686
C  -1.267392 -2.838524 0.279362
C  7.731816 -3.713158 -0.312163
C  -2.507987 -0.808386 -0.258709
C  -2.515292 0.161208 0.780036
C  -1.29422 0.368456 1.662964
C  -3.647342 -0.98216 -1.07552
C  -3.680701 0.932903 0.983271
C  -4.835526 0.765301 0.171544
C  -4.803656 -0.205858 -0.871262
C  -0.564883 2.638397 1.00228
C  0.725168 2.446448 0.421562
C  -1.303591 3.777981 0.630772
C  1.227432 3.368761 -0.523242
C  0.466811 4.514698 -0.892177
C  -0.806228 4.717146 -0.295608
C  2.768892 1.092557 0.296793
H  2.527113 -3.883169 -1.287143
H  2.584622 -4.576097 0.34756
H  3.889252 -1.909254 -0.521682
H  3.91129 -2.549286 1.138387
H  1.283591 -1.853438 -0.369461
H  1.336427 -2.573362 1.254072
H  5.128325 -3.970656 -1.328489
H  5.155243 -4.601626 0.331266
H  0.008962 -4.565414 0.38703
H  -0.057688 -3.803197 -1.223065
H  6.488776 -2.578602 1.076186
H  6.468757 -1.955335 -0.585898
H  -1.242103 -2.583056 1.361283
H  -2.17611 -3.446636 0.086633
H  8.653923 -3.137871 -0.108985
H  7.769076 -4.63701 0.295591
H  7.747764 -4.012879 -1.377206
H  -1.4317 -0.105863 2.651766
H  -0.390667 -0.043374 1.18427
H  -3.607068 -1.722073 -1.882603
H  -3.669701 1.690328 1.776715
H  -5.679036 -0.343329 -1.517928
H  -6.801794 1.432037 -0.196177
H  -6.00082 2.239684 1.125649
H  -2.286491 3.918839 1.091571
H  2.213341 3.216671 -0.975264
H  -1.404971 5.595791 -0.561767
H  1.879339 5.277574 -2.264896
H  0.433681 6.237669 -2.103413
H  3.449549 1.934424 0.531537
H  2.723797 0.944878 -0.80037
H  3.134195 0.173694 0.777969
