program: Gaussian 09
title: 000201332
version: EM64L-G09RevD.01
frameworkgroup: C1[X(C18H31NOS)]
method: RPBEPBE
basis: SDD
operation: Freq
keyword: #p
keyword: freq=noraman
keyword: PBEPBE/SDD
title: #p freq=noraman PBEPBE/SDD
converged: YES YES NO NO
title: Mulliken charges:
elementType: S O N C C C C C C C C C C C C C C C C C C H H H H H H H H H H H H H H H H H H H H H H H H H H H H H H H
charge: 0.140461 -0.302327 -0.710910 -0.386742 -0.382386 -0.358524 -0.353332 -0.390027 -0.347815 -0.304557 -0.697906 0.129829 0.431563 -0.839603 -0.326349 -0.574295 0.535787 -0.425451 -0.619926 -0.339705 -0.676962 0.184839 0.195163 0.190620 0.190421 0.196235 0.213129 0.193387 0.184701 0.206641 0.189115 0.191461 0.195023 0.221236 0.200765 0.216017 0.208172 0.207333 0.297900 0.262777 0.237529 0.231764 0.216310 0.241320 0.242751 0.213746 0.214170 0.218702 0.221412 0.208362 0.305073 0.303107
chargesum: 0.00000
title: Mulliken charges with hydrogens summed into heavy atoms:
elementType: S O N C C C C C C C C C C C C C C C C C C
charge: 0.140461 -0.302327 -0.102730 -0.006740 -0.001345 0.050839 0.024756 0.005729 0.038669 0.117444 -0.066384 0.129829 0.431563 -0.278926 -0.088820 -0.342531 0.535787 -0.209140 -0.135856 0.088211 -0.028486
polarizability: 3.09918153e+02 -1.09910267e+01 2.31296050e+02 -7.71754335e+00 -1.14382146e+01 1.61318659e+02
1716.lowfreq: -30.3875 -10.9837 -6.0340 -0.0007 0.0018 0.0019 3.5134 8.2055 19.2035
frequency: -29.7667 6.4567 19.1880 27.3086 35.6317 46.9073 53.6823 58.3488 66.5105 82.2368 88.8587 95.9079 99.5733 119.7933 131.8727 174.8344 186.7151 208.8358 214.9191 233.3116 239.1052 244.6237 264.7304 280.8652 289.4542 323.1706 329.8713 344.9369 353.4568 384.2848 392.5364 425.8077 458.0922 470.8926 486.0406 535.9131 572.3218 595.5962 669.8211 700.8414 710.8964 722.6433 737.4267 746.7068 747.9694 763.0398 773.7052 815.0660 821.2704 853.4967 868.3045 872.7623 874.5973 899.7803 901.6972 905.2280 914.3614 938.0046 946.3169 948.8489 1001.1134 1021.9985 1033.7179 1044.0772 1047.9519 1054.3707 1074.4254 1079.1759 1095.4767 1101.9158 1104.6319 1123.6161 1134.5513 1140.4390 1170.1067 1176.4910 1197.8809 1205.1295 1214.6049 1223.8363 1230.7409 1249.1193 1259.8061 1267.1734 1269.8344 1275.5514 1284.4534 1287.7797 1289.5543 1295.3866 1330.1183 1333.1131 1336.1349 1341.8170 1356.5741 1361.3544 1371.7667 1381.2137 1384.9509 1389.9795 1444.0080 1446.9558 1450.7398 1456.6233 1460.5352 1463.4383 1465.5172 1475.2487 1476.8763 1477.1434 1479.7422 1481.1746 1482.2307 1485.6340 1486.5612 1496.4390 1582.4344 1629.5698 1643.3000 2945.3288 2947.3865 2951.7825 2956.4342 2965.5256 2967.2185 2969.3505 2973.6989 2975.2910 2985.0813 2987.9895 2992.4859 3000.0079 3007.3642 3009.3483 3020.2319 3023.6283 3031.5431 3031.7027 3049.7852 3059.3086 3065.1223 3068.1815 3076.2768 3078.8743 3100.9088 3114.2350 3121.5913 3153.5745 3571.4139 3711.9831
redmass: 1.9876 2.9979 2.9869 2.7795 4.8815 4.2965 2.3784 3.8947 4.1000 3.8256 2.5538 2.3860 2.3373 4.4464 2.5527 4.2593 2.3864 2.2570 4.0399 1.1110 1.8687 1.2835 3.5418 2.7145 2.6936 4.2067 1.2247 3.4111 1.1136 2.6832 4.6409 3.5956 3.2089 3.0587 2.8774 4.3668 3.6249 5.3354 4.4734 2.6824 3.3983 1.1683 2.4883 1.5079 1.1417 2.5562 1.5005 1.5002 1.7859 1.2105 2.0143 1.7939 1.9333 1.9089 1.6831 1.9251 1.4768 1.4040 2.2243 2.4828 1.4250 2.7558 1.4762 1.2029 2.7764 1.9685 2.4421 2.0231 1.8613 2.1184 2.0543 2.2139 1.1683 1.9118 1.6991 1.4534 2.0889 1.4364 1.4111 1.2312 1.3280 1.3148 1.4516 1.2704 1.2761 1.2227 1.1038 1.0901 1.0839 1.1461 2.7585 1.4593 1.4428 1.4624 1.5522 1.6058 1.3631 6.0792 1.2155 1.2099 1.7959 1.0963 1.3276 1.3013 1.0715 1.0797 1.0784 1.0567 1.0653 1.0521 1.0476 1.1254 1.1089 1.0757 1.0788 2.8360 7.3047 2.8636 1.4929 1.0558 1.0586 1.0594 1.0616 1.0592 1.0612 1.0365 1.0632 1.0355 1.0581 1.0967 1.0575 1.0949 1.1041 1.1031 1.0577 1.1012 1.1017 1.1038 1.1037 1.1060 1.1006 1.0992 1.0994 1.1028 1.1072 1.0912 1.0883 1.0958 1.0448 1.1040
irintensity: 0.7459 0.0303 0.1073 0.5322 0.3151 0.2902 0.7563 1.9537 0.3983 2.1061 0.9437 2.0183 0.8426 1.9150 0.4386 0.0408 1.1285 1.7404 4.0800 0.0991 0.2027 0.0327 2.9930 5.2096 3.8507 0.4572 290.0677 0.5584 18.2240 0.0439 2.2839 1.2485 4.9793 5.0911 0.8287 0.6921 6.8044 9.1189 4.6422 14.0497 2.4380 6.5535 2.1515 8.7585 4.3439 0.9132 3.7480 37.0908 12.9286 0.7861 35.8887 8.4781 13.0279 6.0560 3.2531 21.5150 7.2380 0.2929 20.7264 8.0832 5.8353 16.6558 4.6186 1.8936 1.4185 5.6667 2.6033 11.8207 17.6916 0.5166 14.1143 2.0134 6.1151 3.3857 20.7038 4.2525 113.6455 8.4707 0.6634 34.0664 2.9636 3.1168 6.1572 3.2534 1.4726 2.6426 0.1550 0.4232 2.1049 0.5823 20.7588 0.3154 3.1228 0.1848 1.4636 2.4365 29.5482 9.0471 6.5608 12.9366 33.6073 3.8552 1.2465 4.5009 3.0613 1.6126 0.8543 3.3532 6.6312 19.0683 3.4514 11.0883 36.3158 2.5186 25.2369 160.7638 5.5361 11.4881 266.6572 36.2445 7.9542 24.1243 18.6394 65.8334 46.0276 30.5949 78.6461 33.3253 11.0276 0.1710 60.0160 38.3212 28.8631 13.2380 21.6841 4.9731 1.7015 91.6846 95.3583 2.5157 106.9042 68.5726 53.3233 83.5592 2.6592 15.4941 26.6272 14.9975 72.4176 19.1853
temp: 298.150 k
press: 1.00000 atm
elementType: 16 8 7 6 6 6 6 6 6 6 6 6 6 6 6 6 6 6 6 6 6 1 1 1 1 1 1 1 1 1 1 1 1 1 1 1 1 1 1 1 1 1 1 1 1 1 1 1 1 1 1 1
symmnumber: 1
zpe: 1189770.7 jmol-1
zpe.correction: 0.453160 hartree
zpe.thermalcorrener: 0.478514 hartree
zpe.thermalcorrenthalpy: 0.479458 hartree
zpe.thermalcorrgfe: 0.393345 hartree
zpe.sumelectzpe: -1230.876052 hartree
zpe.sumelectthermal: -1230.850698 hartree
zpe.sumelectthermalent: -1230.849754 hartree
zpe.sumelectthermalfe: -1230.935867 hartree
dipole: 0.9953 1.3755 -0.1815
dipole: 1.7075
quadrupole: -110.0882 -133.4227 -140.2629
quadrupole: 4.2980 -2.9526 -8.1239
quadrupole: 17.8364 -5.4981 -12.3383 4.2980 -2.9526 -8.1239
hfenergy: -1231.3292119 hartree
pointgroup: C01 [X(C18H31N1O1S1)]
dipole: -0.3879455 0.5483154 0.0117231 debye
polarizability: 310.0759229|9.5677936|232.807555|-8.6138297|3.7002003|159.6493843 unknown
InChI: InChI=1S/C18H31NOS/c1-3-5-6-7-8-9-12-20-18-11-10-17(19)14-16(18)15-21-13-4-2/h10-11,14H,3-9,12-13,15,19H2,1-2H3
charge 0 multiplicity 1
52 atoms
S  -0.531448 1.939202 -0.971041
O  -1.367821 -1.735948 0.211048
N  -6.080102 1.393181 0.558374
C  2.9049 -2.805647 -0.117988
C  3.971735 -2.188892 0.819403
C  1.583555 -2.006133 -0.190268
C  4.47665 -0.791982 0.387811
C  0.491638 -2.73336 -1.006556
C  5.631291 -0.27003 1.273592
C  -0.799488 -1.924904 -1.155053
C  6.128004 1.132517 0.86182
C  -2.539909 -0.932932 0.253883
C  -2.444554 0.466038 0.499392
C  -1.099327 1.12389 0.672702
C  -3.808091 -1.541378 0.124923
C  -3.634077 1.224646 0.60099
C  -4.915465 0.62468 0.458555
C  -4.987699 -0.779156 0.223257
C  1.187758 2.513952 -0.409766
C  1.886841 3.266433 -1.555891
C  3.291277 3.765196 -1.144997
H  3.329425 -2.907216 -1.139509
H  2.677071 -3.835348 0.22814
H  3.559142 -2.124505 1.848244
H  4.841923 -2.875731 0.876162
H  1.765832 -1.010259 -0.643674
H  1.201819 -1.827294 0.833932
H  3.641307 -0.062034 0.417816
H  4.815941 -0.834768 -0.669012
H  0.254504 -3.704905 -0.529435
H  0.872962 -2.957276 -2.024747
H  6.474586 -0.989631 1.229718
H  5.29677 -0.249749 2.331139
H  -0.605359 -0.928821 -1.604235
H  -1.543638 -2.463723 -1.778161
H  6.958647 1.474653 1.506442
H  6.489353 1.134047 -0.184282
H  5.314337 1.879156 0.937013
H  -0.335198 0.378019 0.943068
H  -1.133309 1.928952 1.425942
H  -3.857896 -2.623761 -0.037011
H  -3.559787 2.303443 0.789827
H  -5.965608 -1.266306 0.124871
H  1.057812 3.169854 0.470734
H  1.768755 1.622334 -0.108191
H  1.260251 4.12527 -1.865405
H  1.97016 2.599308 -2.435714
H  3.947601 2.921674 -0.860015
H  3.776603 4.304223 -1.978854
H  3.233461 4.456533 -0.283313
H  -6.030854 2.396167 0.707062
H  -6.995075 0.966216 0.453759
