program: Gaussian 09
title: 000201251
version: EM64L-G09RevD.01
frameworkgroup: C1[X(C9H9N3O2)]
method: RPBEPBE
basis: SDD
operation: Freq
keyword: #pfreq=noraman
keyword: PBEPBE/SDD
title: #p freq=noraman PBEPBE/SDD
converged: YES YES NO NO
title: Mulliken charges:
elementType: O O N N N C C C C C C C C C H H H H H H H H H
charge: -0.268135 -0.279586 -0.106879 -0.148670 -0.602520 0.223002 0.199353 0.078201 -0.349915 -0.353318 -0.247685 -0.205445 0.185214 -0.522826 0.267002 0.253940 0.234363 0.232744 0.246881 0.231576 0.237636 0.349885 0.345182
chargesum: 0.00000
title: Mulliken charges with hydrogens summed into heavy atoms:
elementType: O O N N N C C C C C C C C C
charge: -0.268135 -0.279586 -0.106879 -0.148670 0.092547 0.223002 0.199353 0.078201 -0.082913 -0.099378 -0.013322 0.027298 0.185214 0.193267
polarizability: 1.92938476e+02 7.39978844e+00 1.24292376e+02 4.99723801e+00 -8.50238708e+00 6.85361210e+01
1716.lowfreq: -7.6985 0.0009 0.0009 0.0011 3.7765 6.0446 37.5617 74.1525 80.6139
frequency: 37.5471 74.1435 80.6058 97.9266 145.1599 170.9515 245.5958 261.0798 287.9534 299.0231 313.4207 362.3256 417.2311 449.1530 469.6421 491.8732 544.0581 560.0456 640.2846 651.4757 683.6532 706.8315 742.6584 766.7077 775.5923 861.0499 871.9687 876.5225 939.1773 959.1185 962.1267 974.3586 986.2628 1040.5492 1044.2980 1094.0262 1109.0284 1149.1453 1168.2729 1206.2254 1221.9037 1273.1291 1333.6211 1368.8095 1421.8430 1433.8778 1456.4132 1457.8969 1483.2134 1522.4133 1569.5571 1579.5558 1612.0812 1639.0852 2984.5156 3093.1401 3111.9454 3137.6218 3152.0133 3166.8091 3177.0382 3575.6990 3722.6031
redmass: 6.5079 3.0101 5.7341 2.3038 1.9796 2.8080 3.3019 4.4449 4.5579 2.9584 2.1831 2.1177 3.9350 1.3037 3.7120 5.0607 4.0765 4.7752 6.7294 9.5725 9.0946 7.2073 4.0680 1.6931 2.8623 9.7174 1.9965 3.7239 4.1173 1.8662 3.2110 7.2547 1.3436 3.0211 1.9908 1.9936 1.2516 1.3315 1.0751 2.7557 3.3752 1.6231 3.4723 8.9075 1.6213 2.0857 1.0592 1.9701 1.0530 6.0244 2.6608 2.3874 6.6081 3.0069 1.0306 1.1023 1.1043 1.0860 1.0902 1.0950 1.1003 1.0448 1.1057
irintensity: 9.9338 3.5786 1.6041 3.4458 3.7725 2.2834 3.0504 4.9214 2.2902 16.5547 13.5506 45.3768 16.2608 246.5435 4.6128 8.2855 0.7616 12.6004 10.5366 1.8217 16.6141 3.3848 0.1119 65.5869 37.0693 18.5307 10.2646 8.6598 28.5001 12.9341 15.5577 26.2116 0.6253 38.0655 6.3142 28.3431 5.3410 0.1789 2.2382 11.6180 102.9883 21.1636 18.9300 21.9450 43.5874 9.8179 11.6656 75.1665 14.3638 32.0235 34.2396 27.4139 38.1853 558.7993 50.2651 29.6969 24.1576 3.0405 8.3035 10.6465 16.7857 156.4986 64.3239
temp: 298.150 k
press: 1.00000 atm
elementType: 8 8 7 7 7 6 6 6 6 6 6 6 6 6 1 1 1 1 1 1 1 1 1
symmnumber: 1
zpe: 448670.5 jmol-1
zpe.correction: 0.170890 hartree
zpe.thermalcorrener: 0.183552 hartree
zpe.thermalcorrenthalpy: 0.184496 hartree
zpe.thermalcorrgfe: 0.131326 hartree
zpe.sumelectzpe: -661.995806 hartree
zpe.sumelectthermal: -661.983144 hartree
zpe.sumelectthermalent: -661.982200 hartree
zpe.sumelectthermalfe: -662.035369 hartree
dipole: 1.1383 2.8562 -1.9171
dipole: 3.6234
quadrupole: -59.4990 -81.6140 -83.5666
quadrupole: 12.3455 -9.4641 5.8797
quadrupole: 15.3942 -6.7208 -8.6734 12.3455 -9.4641 5.8797
hfenergy: -662.1666957 hartree
pointgroup: C01 [X(C9H9N3O2)]
dipole: 0.2875275 -0.5102901 1.2996519 debye
dipolederiv: -0.845201 0.0341048 -0.1048752 -0.0184954 -0.1105974 0.1147712 -0.0176445 0.1187154 -0.5962006 -0.474602 0.5351887 -0.2148919 0.3102705 -1.1030416 0.2582459 -0.0563542 0.4346714 -0.4908644 0.1847383 0.0087166 0.0481761 0.0660229 -0.2101138 -0.006242 0.3635593 -0.0078594 -0.1989021 -0.5698333 -0.0097354 0.0521333 0.1139674 -0.2582286 0.067375 -0.9602355 0.0597994 -0.5451133 -1.0729935 0.1123337 -0.54554 0.2808518 -0.722442 0.0745022 -0.867511 0.0285006 -0.7403741 -0.0811755 -0.0777126 0.0800101 0.2130025 -0.1403336 0.027367 -0.0986808 0.1468986 -0.1486197 0.2646996 -0.3529659 0.2138502 -0.2097234 0.9132349 -0.3589468 0.0812526 -0.6020778 0.3154944 0.6918262 -0.0204838 -0.0104876 -0.1933302 0.0883713 -0.0666758 0.2633542 -0.0433179 0.4924073 0.083582 0.0367828 -0.0789444 -0.1663302 -0.0163349 -0.0485675 0.0972986 -0.089325 -0.0450682 -0.1253854 0.284999 -0.1892025 0.0835784 -0.2803656 0.0002847 -0.0684846 -0.0740017 -0.0778875 -0.2494146 -0.1261992 0.095842 -0.0905089 -0.0738458 -0.0997965 0.0408393 -0.069661 -0.1149709 0.0945213 -0.0366675 -0.0407798 0.0284006 0.0735252 -0.150677 -0.0835785 -0.1453139 -0.0102366 1.2233563 -0.0987913 0.5003571 -0.29147 0.26836 -0.2190433 1.158537 -0.1950283 1.0839116 0.4050646 -0.4061554 0.0876345 -0.1418225 0.5487801 -0.0186894 -0.0680906 0.1310219 0.1991142 0.0596257 -0.055781 0.0616406 -0.0351622 0.0788479 0.0551712 0.0491208 0.0717286 0.0934584 0.0399964 -0.0414788 0.0528928 -0.0550446 0.0601821 0.0955412 0.0733967 0.0750893 0.0915727 0.0397149 0.063971 -0.0284769 0.0829942 0.0082433 0.1190494 -0.0391438 0.1202692 0.0749831 -0.1173715 0.0575505 0.0203708 0.0585009 0.1121743 0.0215067 0.0318064 0.0350548 0.124168 -0.1386908 0.0757467 -0.0654294 -0.0099851 0.0777481 -0.0395498 -0.0545741 -0.0590584 0.0662601 0.0493243 0.0691719 -0.0189647 0.0264415 0.0523265 0.0491979 0.0343503 -0.0746743 -0.112119 0.0444726 -0.0410958 0.0321974 -0.0085097 -0.1664008 0.08022 0.0337095 0.0725058 0.0962006 0.3286786 -0.0125531 0.0416056 -0.0078798 0.3922139 0.0459581 -0.0092935 0.0449534 0.179664 0.165067 0.0010541 0.0108818 -0.0357686 0.4076966 -0.0010024 0.0963664 0.0211093 0.2631219 unknown
polarizability: 189.9101906|-15.8569633|99.7988815|5.4547827|-30.4948881|96.057901 unknown
InChI: InChI=1S/C9H9N3O2/c1-13-7-5-3-2-4-6(7)8-11-12-9(10)14-8/h2-5H,10H2,1H3
charge 0 multiplicity 1
23 atoms
O  1.470301 0.074015 0.949649
O  -1.209944 -1.457802 1.357829
N  1.538041 0.585688 -1.282593
N  2.897268 0.497086 -0.804119
N  3.797952 -0.027537 1.404455
C  -0.733696 0.469634 -0.199127
C  -1.595765 -0.337305 0.607214
C  0.721458 0.34098 -0.259605
C  -1.314715 1.522063 -0.968599
C  -2.97345 -0.018832 0.701048
C  -2.688835 1.807142 -0.900977
C  -3.517786 1.046427 -0.039089
C  2.799004 0.194542 0.498774
C  -0.22497 -2.403634 0.799084
H  -0.649026 2.120208 -1.598916
H  -3.597158 -0.648576 1.342487
H  -3.107919 2.623563 -1.497314
H  -4.587084 1.270342 0.04015
H  0.789202 -2.16068 1.155576
H  -0.247382 -2.39785 -0.306367
H  -0.529286 -3.393497 1.174522
H  4.761028 0.058095 1.092706
H  3.586059 -0.154774 2.389313
