program: Gaussian 09
title: 000201250
version: EM64L-G09RevD.01
frameworkgroup: C1[X(C8H16N2S2)]
method: RPBEPBE
basis: SDD
operation: Freq
keyword: #p
keyword: freq=noraman
keyword: PBEPBE/SDD
title: #p freq=noraman PBEPBE/SDD
converged: YES YES NO NO
title: Mulliken charges:
elementType: S S N N C C C C C C C C H H H H H H H H H H H H H H H H
charge: -0.015050 0.011883 -0.080612 0.035718 -0.327958 -0.350391 -0.395584 -0.378788 -0.300644 -0.382958 -0.526945 -0.685725 0.219376 0.194554 0.200581 0.221360 0.239134 0.236424 0.230744 0.253866 0.175680 0.202629 0.216491 0.201234 0.209909 0.211100 0.222309 0.161664
chargesum: 0.00000
title: Mulliken charges with hydrogens summed into heavy atoms:
elementType: S S N N C C C C C C C C
charge: 0.146613 0.011883 -0.080612 0.035718 0.085972 0.071551 0.079973 0.105822 0.077665 0.034767 -0.526945 -0.042407
polarizability: 1.80702150e+02 -5.63148297e+00 1.37818684e+02 -1.29822159e+01 1.52097219e+00 8.86309343e+01
1716.lowfreq: -6.8127 -0.0021 -0.0019 -0.0014 1.0514 14.5136 27.7782 56.7597 64.6780
frequency: 27.3164 56.6681 64.5857 73.6138 102.7620 173.1578 203.3375 229.0021 242.0847 263.4699 305.9942 314.3748 327.0600 344.9319 405.6718 413.1970 427.9526 466.8023 525.9494 548.0268 622.6234 754.4352 758.8146 788.2717 829.4846 859.5156 879.6873 903.5110 931.3930 988.6331 1001.9570 1040.6138 1045.5596 1050.0544 1088.1020 1106.5340 1130.6297 1141.7083 1147.6572 1195.0584 1202.0482 1242.2618 1250.3720 1268.2448 1289.7501 1299.5827 1311.8920 1335.1604 1340.3917 1356.2160 1368.4765 1387.3529 1396.5999 1440.7813 1451.4572 1455.5568 1464.8322 1471.9275 1478.1558 1479.0718 1480.8462 1489.7939 2474.7217 2841.5302 2854.5630 2871.0481 2975.8791 2984.8769 2994.0542 2997.5984 3006.3328 3036.8863 3040.8934 3058.4384 3073.7051 3079.3607 3088.9399 3097.0863
redmass: 5.1937 4.3355 1.8883 3.4101 3.3303 3.2037 2.2417 1.1846 4.8546 2.9710 2.3594 2.2515 1.4182 3.4289 2.4247 3.3029 4.6636 2.8464 6.8383 4.8808 2.1513 1.2431 2.6223 2.1415 1.6036 1.9513 1.2588 1.8518 2.1316 2.6640 2.6122 2.3304 1.9158 2.6539 2.1493 2.2890 2.3165 2.4112 2.9650 1.1693 2.6084 1.3957 1.2938 1.2894 1.3389 1.1878 1.3782 1.2626 1.3488 1.3659 1.3705 1.3141 1.3314 1.7166 1.0783 1.0792 1.0908 1.0804 1.0615 1.0449 1.6868 1.0898 1.0375 1.0707 1.0711 1.0696 1.0358 1.0618 1.0642 1.0656 1.0856 1.0900 1.1001 1.0883 1.1012 1.0993 1.0991 1.0971
irintensity: 0.8596 0.0908 0.1576 0.1918 0.7981 1.5037 1.8102 0.5130 3.2546 2.8739 19.3741 24.9972 7.6788 4.9131 6.3088 7.3155 1.8682 0.8883 4.3314 11.1597 2.9558 1.0383 18.5007 25.6208 3.3930 48.7166 4.3086 0.6161 46.6548 73.4598 60.5514 12.0612 11.7543 0.7049 2.9659 19.0023 15.8780 31.6203 41.9862 6.1685 7.0687 102.9867 14.7393 34.1433 38.6933 19.5091 7.3411 6.9621 5.3923 4.1984 5.1087 4.6786 11.1330 182.5635 13.4250 0.6667 2.8252 4.1506 7.0732 9.6917 108.5141 17.0363 3.3663 58.4844 57.0591 123.3005 42.6171 18.9245 14.7269 47.8663 24.9940 32.9654 21.7547 33.1622 76.9545 47.5462 10.6735 12.1456
temp: 298.150 k
press: 1.00000 atm
elementType: 16 16 7 7 6 6 6 6 6 6 6 6 1 1 1 1 1 1 1 1 1 1 1 1 1 1 1 1
symmnumber: 1
zpe: 613187.2 jmol-1
zpe.correction: 0.233551 hartree
zpe.thermalcorrener: 0.247348 hartree
zpe.thermalcorrenthalpy: 0.248292 hartree
zpe.thermalcorrgfe: 0.191671 hartree
zpe.sumelectzpe: -1219.086980 hartree
zpe.sumelectthermal: -1219.073182 hartree
zpe.sumelectthermalent: -1219.072238 hartree
zpe.sumelectthermalfe: -1219.128859 hartree
dipole: -4.2928 1.2487 0.2256
dipole: 4.4764
quadrupole: -95.6699 -88.3370 -90.7696
quadrupole: 6.2351 1.2274 -0.9176
quadrupole: -4.0778 3.2552 0.8226 6.2351 1.2274 -0.9176
hfenergy: -1219.3205303 hartree
pointgroup: C01 [X(C8H16N2S2)]
dipole: -1.6878364 0.5020512 0.0294056 debye
polarizability: 180.2585167|-8.0071995|136.8609497|-13.3129738|-6.9014571|90.0323023 unknown
InChI: InChI=1S/C8H16N2S2/c1-2-3-9-4-6-10(7-5-9)8(11)12/h11H,2-7H2,1H3
charge 0 multiplicity 1
28 atoms
S  3.527727 1.688019 -0.657727
S  3.921041 -1.359254 -0.228268
N  -1.24805 -0.233887 0.280379
N  1.634436 0.033554 0.386896
C  -0.575594 0.974642 -0.253611
C  -0.360341 -1.416513 0.13908
C  0.754136 1.224046 0.487169
C  0.967564 -1.197623 0.884708
C  -2.588485 -0.478305 -0.314232
C  -3.636511 0.594562 0.046687
C  2.911961 0.014708 -0.10237
C  -5.050802 0.184581 -0.419595
H  -1.225611 1.853201 -0.099667
H  -0.370168 0.886441 -1.351547
H  -0.138433 -1.647222 -0.933574
H  -0.868612 -2.295714 0.575962
H  1.254944 2.109502 0.066807
H  0.544824 1.412746 1.558086
H  0.771497 -1.071101 1.967153
H  1.654971 -2.045139 0.734711
H  -2.530238 -0.577663 -1.430042
H  -2.941363 -1.454168 0.073925
H  -3.62286 0.742854 1.143331
H  -3.372818 1.566136 -0.414867
H  -5.079177 0.015157 -1.512723
H  -5.377379 -0.74965 0.074507
H  -5.791954 0.968428 -0.181456
H  4.752197 1.176763 -1.037118
