program: Gaussian 09
title: 000201260
version: EM64L-G09RevD.01
frameworkgroup: C1[X(C12H15NO3S)]
method: RPBEPBE
basis: SDD
operation: Freq
keyword: #p
keyword: freq=noraman
keyword: PBEPBE/SDD
title: #p freq=noraman PBEPBE/SDD
converged: YES YES NO NO
title: Mulliken charges:
elementType: S O O O N C C C C C C C C C C C C H H H H H H H H H H H H H H H
charge: 0.174062 -0.266450 -0.261888 -0.199141 -0.212088 0.537468 -0.429333 0.384661 -0.551976 -0.190164 -0.328998 -0.814248 0.306049 -0.610424 0.216487 -0.753797 -0.841578 0.280672 0.257572 0.300252 0.232199 0.250897 0.232611 0.283011 0.234553 0.237441 0.239424 0.267263 0.236877 0.268756 0.265263 0.254564
chargesum: 0.00000
title: Mulliken charges with hydrogens summed into heavy atoms:
elementType: S O O O N C C C C C C C C C C C C
charge: 0.174062 -0.266450 -0.261888 -0.199141 -0.212088 0.537468 -0.429333 0.384661 -0.271304 0.067408 -0.028746 -0.098541 0.306049 0.144581 0.216487 -0.010232 -0.052994
polarizability: 2.56525488e+02 4.12714684e+00 1.63326608e+02 8.43159166e+00 1.63616154e+00 9.69239397e+01
1716.lowfreq: -17.7908 -7.6295 -5.1831 -0.0019 -0.0015 -0.0008 7.7947 26.8541 41.7298
frequency: 6.0440 26.8454 41.7230 53.1538 71.0874 74.8352 84.7363 101.7426 109.9885 146.8871 174.7705 181.9503 188.3979 212.1025 241.2094 257.5309 271.7697 309.6572 356.7953 375.2663 397.9206 416.2543 451.6671 466.4411 531.6257 544.0975 569.5588 574.9918 593.5522 641.1202 652.4348 700.7347 720.4613 729.2784 763.2265 838.9992 894.4810 904.9962 949.6689 962.1967 967.3025 987.6366 988.2841 1006.9594 1030.1287 1031.1602 1047.1191 1104.4008 1113.9182 1123.1270 1131.7745 1166.4727 1219.7213 1236.1880 1264.4251 1278.2092 1336.0730 1366.0180 1375.9175 1392.9813 1404.5902 1427.1116 1444.2801 1445.7759 1453.7070 1460.2529 1461.8911 1467.8744 1478.5096 1480.9267 1499.2927 1565.3500 1608.4651 1616.0203 1640.9152 2975.2173 2994.4900 3001.9741 3010.0362 3057.0898 3081.5997 3090.2763 3092.9982 3131.0038 3132.2849 3134.9611 3135.2709 3153.3989 3159.9374 3210.3103
redmass: 4.2088 5.1560 4.7327 3.5109 3.7440 2.8298 1.3462 2.7011 1.2076 1.1972 4.7329 2.2918 1.6736 2.7505 3.8620 3.7919 4.6534 5.1183 5.0058 4.2559 4.1632 6.1967 2.9257 3.9596 5.4440 5.1220 3.0338 3.8027 4.3528 6.8125 7.0375 10.0875 3.5991 6.3876 7.5090 1.3387 3.7966 1.4531 2.7894 1.1899 1.3233 1.4793 1.3909 1.7591 1.7179 5.2049 1.5530 3.1699 1.6157 1.6133 1.6064 2.5030 2.9580 6.9512 1.4428 3.4874 1.1356 8.9014 1.2305 1.2211 3.2046 1.1587 1.0676 1.0801 1.8410 1.1496 1.0491 1.1427 1.0539 1.1499 1.0465 6.2537 7.1875 9.5280 9.3659 1.0390 1.0377 1.0348 1.0279 1.0939 1.0979 1.1031 1.1001 1.1043 1.0990 1.0992 1.1052 1.0911 1.0927 1.0948
irintensity: 1.2389 2.1881 6.5255 2.2109 3.0088 0.1969 0.4783 0.3838 0.3829 1.0096 1.3665 1.2354 0.7679 0.5362 2.0725 0.8509 2.2053 7.9447 4.9629 3.5654 11.0122 0.4449 7.5149 2.6609 4.6831 0.7730 4.1435 7.7705 25.8957 0.4018 2.2895 18.5976 0.5962 1.8893 5.2414 40.6810 16.0705 24.0465 17.5856 11.6916 1.2866 97.0682 7.5034 16.7999 7.9954 45.6498 11.2368 23.3658 256.6911 220.2625 38.8317 283.6666 167.9391 282.2399 47.9027 396.6068 0.5695 11.9567 54.7818 17.0411 17.4082 77.9200 11.9289 21.9751 34.2324 33.4082 12.3663 16.1240 30.6272 61.9874 33.1764 21.5547 53.7413 198.8495 223.8336 23.8994 1.0339 61.7337 35.2695 19.9627 8.3143 27.5527 9.0542 15.5333 1.6197 7.0142 12.9419 4.5738 0.7798 2.1884
temp: 298.150 k
press: 1.00000 atm
elementType: 16 8 8 8 7 6 6 6 6 6 6 6 6 6 6 6 6 1 1 1 1 1 1 1 1 1 1 1 1 1 1 1
symmnumber: 1
zpe: 649415.7 jmol-1
zpe.correction: 0.247349 hartree
zpe.thermalcorrener: 0.266454 hartree
zpe.thermalcorrenthalpy: 0.267399 hartree
zpe.thermalcorrgfe: 0.196178 hartree
zpe.sumelectzpe: -1143.493650 hartree
zpe.sumelectthermal: -1143.474545 hartree
zpe.sumelectthermalent: -1143.473601 hartree
zpe.sumelectthermalfe: -1143.544822 hartree
dipole: -3.2899 0.3727 0.5188
dipole: 3.3513
quadrupole: -76.4974 -110.8278 -108.6604
quadrupole: 6.7700 10.2706 -0.9027
quadrupole: 22.1645 -12.1659 -9.9986 6.7700 10.2706 -0.9027
hfenergy: -1143.7409994 hartree
pointgroup: C01 [X(C12H15N1O3S1)]
dipole: -1.2767258 -0.0029416 0.3292924 debye
polarizability: 257.1086712|2.1793312|142.366896|0.459491|30.937341|117.3004682 unknown
InChI: InChI=1S/C12H15NO3S/c1-8-7-10(5-6-11(8)17-4)16-12(15)13(3)9(2)14/h5-7H,1-4H3
charge 0 multiplicity 1
32 atoms
S  4.914816 -0.373635 -0.82761
O  -1.119861 -0.100304 -0.182415
O  -1.863102 -2.232309 -0.836909
O  -2.69789 1.025664 1.627496
N  -3.349511 -0.641564 0.063583
C  2.454322 0.772013 0.117088
C  3.084064 -0.307592 -0.572211
C  0.287858 -0.286773 -0.353287
C  1.043027 0.757321 0.218018
C  2.307745 -1.342557 -1.14293
C  0.898355 -1.351338 -1.050624
C  3.238237 1.911822 0.737934
C  -2.063796 -1.097637 -0.340916
C  -4.490079 -1.478503 -0.394379
C  -3.592011 0.471332 0.9452
C  -5.048079 0.927394 1.012884
C  5.491446 -0.821651 0.918521
H  0.509043 1.556736 0.741119
H  2.816853 -2.1556 -1.669863
H  0.306426 -2.155718 -1.487312
H  3.50933 1.684842 1.787601
H  4.176441 2.089946 0.184194
H  2.644737 2.841805 0.74952
H  -4.080802 -2.319077 -0.972417
H  -5.17298 -0.895049 -1.034656
H  -5.051092 -1.886402 0.463442
H  -5.700477 0.156131 1.46089
H  -5.083658 1.82696 1.644124
H  -5.449777 1.166488 0.011999
H  5.017661 -1.762329 1.236401
H  5.252625 -0.011018 1.62342
H  6.583531 -0.950899 0.8544
