program: Gaussian 09
title: 000201242
version: EM64L-G09RevD.01
frameworkgroup: C1[X(C16H9NOS)]
method: RPBEPBE
basis: SDD
operation: Freq
keyword: #p
keyword: freq=noraman
keyword: PBEPBE/SDD
title: #p freq=noraman PBEPBE/SDD
converged: NO YES NO NO
title: Mulliken charges:
elementType: S O N C C C C C C C C C C C C C C C C H H H H H H H H H
charge: 0.205812 -0.241060 -0.006268 -0.365591 0.400376 0.378216 0.407795 -0.315746 0.037775 -0.088481 -0.498468 -0.345937 -0.332328 -0.293689 -0.298396 -0.246588 -0.242467 -0.220223 -0.226013 0.294309 0.239345 0.288053 0.248869 0.268649 0.234295 0.240653 0.239410 0.237698
chargesum: 0.00000
title: Mulliken charges with hydrogens summed into heavy atoms:
elementType: S O N C C C C C C C C C C C C C C C C
charge: 0.205812 -0.241060 -0.006268 -0.365591 0.400376 0.378216 0.407795 -0.315746 0.037775 -0.088481 -0.204159 -0.106592 -0.044276 -0.044820 -0.029748 -0.012293 -0.001813 0.019188 0.011685
polarizability: 3.48025216e+02 8.83204165e+00 2.16759492e+02 -7.41688729e-03 1.29846976e-02 7.25326409e+01
1716.lowfreq: -3.6256 -0.0018 -0.0017 -0.0006 4.7879 5.4548 38.1385 61.4865 103.2484
frequency: 38.1048 61.4855 103.2468 127.1863 150.6132 202.2287 221.0211 264.5449 273.4418 297.6172 363.3980 413.4674 418.1566 424.4968 428.0137 464.2862 480.5929 500.7914 528.4337 548.0512 566.9415 614.7173 631.7001 643.9779 680.3582 701.1153 729.6349 756.2791 772.7288 787.9991 797.9569 812.2418 853.9492 882.5643 888.5709 921.1864 962.6216 972.7131 978.0595 999.2871 1011.4028 1015.6550 1027.4799 1033.3376 1053.7975 1117.2042 1127.6997 1159.7429 1175.0906 1181.6208 1207.0615 1241.6055 1265.0336 1290.3365 1328.1386 1360.5896 1381.2101 1386.4004 1409.1207 1425.1699 1446.6028 1455.6668 1477.7984 1531.6884 1551.3431 1557.0635 1578.9166 1603.7048 1618.2142 3130.3334 3133.3629 3143.4714 3146.0223 3151.3240 3158.2521 3160.1631 3172.3268 3175.6104
redmass: 7.8066 6.3181 4.8163 4.9871 5.7088 5.8332 4.8529 6.7693 7.3766 7.1274 9.9523 10.0901 3.3996 11.7186 3.3183 8.5465 3.7952 3.7571 7.7596 7.7464 4.4759 7.4308 4.2745 6.6489 7.5665 4.0609 7.7689 1.6861 1.3397 2.5512 6.4649 2.8791 7.2831 1.7069 1.4371 7.6659 1.3929 1.4253 1.3825 1.3363 1.3491 4.7237 2.7627 3.2404 2.7068 1.9104 1.7695 1.9426 1.0715 1.4797 2.0270 1.9962 1.6231 2.0652 2.8596 2.8154 4.3075 10.3718 4.7252 2.4214 2.4705 2.4015 3.3344 9.9886 6.9154 7.2527 7.8306 6.2541 6.3496 1.0864 1.0869 1.0899 1.0897 1.0915 1.0941 1.0952 1.1006 1.0993
irintensity: 1.5821 0.0028 0.5526 0.1425 1.1025 0.7110 1.4756 1.1975 3.5749 3.4265 5.5729 1.3229 1.6905 7.4360 10.9991 0.6104 5.2079 0.5382 0.7878 7.1182 1.8493 8.6087 0.4015 1.0819 25.5547 4.4197 5.5753 47.7708 129.0205 4.4681 12.0686 1.4517 11.3586 0.9151 0.0371 2.6453 0.7389 9.9407 4.7334 0.3525 0.9612 17.2526 28.0389 0.2303 15.3605 1.3480 4.1217 7.9187 3.1503 6.1418 1.4410 1.5703 9.6404 39.1614 207.9763 2.1167 17.2249 11.4856 27.5295 79.1674 9.3680 4.3779 21.4289 199.9788 2.4750 75.4352 79.6840 36.5018 9.1120 1.4428 0.8749 9.6322 7.4591 1.4158 3.8982 15.5676 30.9848 20.7585
temp: 298.150 k
press: 1.00000 atm
elementType: 16 8 7 6 6 6 6 6 6 6 6 6 6 6 6 6 6 6 6 1 1 1 1 1 1 1 1 1
symmnumber: 1
zpe: 530264.7 jmol-1
zpe.correction: 0.201967 hartree
zpe.thermalcorrener: 0.215728 hartree
zpe.thermalcorrenthalpy: 0.216672 hartree
zpe.thermalcorrgfe: 0.160955 hartree
zpe.sumelectzpe: -1141.895102 hartree
zpe.sumelectthermal: -1141.881341 hartree
zpe.sumelectthermalent: -1141.880397 hartree
zpe.sumelectthermalfe: -1141.936115 hartree
dipole: 0.7131 -5.2251 0.0032
dipole: 5.2735
quadrupole: -89.6306 -118.7998 -121.3721
quadrupole: 0.3682 0.0032 0.0053
quadrupole: 20.3036 -8.8656 -11.4379 0.3682 0.0032 0.0053
hfenergy: -1142.0970695 hartree
pointgroup: C01 [X(C16H9N1O1S1)]
dipole: 0.2700986 -2.0569245 0.0282177 debye
polarizability: 348.0886856|8.126298|216.6417367|-2.6364694|-2.1225325|72.5869268 unknown
InChI: InChI=1S/C16H9NOS/c18-15-11-6-2-4-8-14(11)19-16-10-5-1-3-7-13(10)17-9-12(15)16/h1-9H
charge 0 multiplicity 1
28 atoms
S  0.481634 -1.736411 -0.043167
O  1.706052 2.66322 -0.115986
N  -2.356785 1.98993 -0.068526
C  -0.574916 -0.263925 -0.053778
C  -0.069797 1.049863 -0.077153
C  -2.004524 -0.484323 -0.036964
C  2.422192 0.371668 -0.088912
C  2.15628 -1.023244 -0.067104
C  1.370403 1.432686 -0.09552
C  -2.857493 0.68571 -0.044875
C  -1.028345 2.133255 -0.083617
C  -2.613165 -1.779275 -0.012812
C  3.782488 0.795283 -0.105673
C  3.214875 -1.966577 -0.062597
C  -4.275645 0.520722 -0.027992
C  -4.0050 -1.913339 0.003377
C  4.836174 -0.130844 -0.101176
C  4.549019 -1.521004 -0.079597
C  -4.843662 -0.756881 -0.004119
H  -0.624923 3.151012 -0.102255
H  -1.984919 -2.677194 -0.006786
H  3.961709 1.875178 -0.122193
H  2.992349 -3.039265 -0.045782
H  -4.884784 1.429512 -0.034538
H  -4.45629 -2.911044 0.021974
H  5.87453 0.215381 -0.114246
H  5.362866 -2.253899 -0.075967
H  -5.932322 -0.875593 0.008783
