program: Gaussian 09
title: 000201304
version: EM64L-G09RevD.01
frameworkgroup: C1[X(C23H28ClN3OS)]
method: RPBEPBE
basis: SDD
operation: Freq
keyword: #p
keyword: freq=noraman
keyword: PBEPBE/SDD
title: #p freq=noraman PBEPBE/SDD
converged: NO YES NO NO
title: Mulliken charges:
elementType: Cl S O N N N C C C C C C C C C C C C C C C C C C C C C C C H H H H H H H H H H H H H H H H H H H H H H H H H H H H
charge: -0.068310 0.225899 -0.437831 -0.114404 -0.087835 -0.290702 -0.145934 -0.161826 -0.460456 -0.441061 -0.401281 -0.421878 -0.334575 -0.326714 -0.436373 -0.412188 -0.340775 0.530507 0.497098 -0.385641 -0.349517 -0.266039 -0.330305 -0.254391 -0.268641 -0.120324 -0.241236 -0.275845 -0.254327 0.224249 0.241773 0.221062 0.220807 0.224213 0.216383 0.193375 0.203758 0.208257 0.208464 0.193048 0.226953 0.200285 0.190319 0.204723 0.240675 0.210192 0.252622 0.200601 0.220150 0.331780 0.276525 0.243735 0.252189 0.247583 0.229069 0.259501 0.232611
chargesum: 0.00000
title: Mulliken charges with hydrogens summed into heavy atoms:
elementType: Cl S O N N N C C C C C C C C C C C C C C C C C C C C C C C
charge: -0.068310 0.225899 -0.106051 -0.114404 -0.087835 -0.290702 0.078315 0.079946 -0.018587 -0.000466 -0.004148 -0.005157 0.085427 0.063891 0.009026 0.050627 0.079976 0.530507 0.497098 -0.385641 -0.349517 0.010486 -0.086570 -0.002202 -0.021058 -0.120324 -0.012168 -0.016344 -0.021716
polarizability: 3.44910097e+02 6.78495647e+01 3.05965706e+02 -3.12567984e+01 2.06916367e+01 2.37251823e+02
1716.lowfreq: -4.1631 -3.2086 -0.0016 -0.0011 0.0012 2.7292 8.8084 15.7162 25.8110
frequency: 3.3836 15.1617 25.5674 35.0961 40.2416 49.1318 59.6906 73.9102 90.0546 93.3072 120.2909 126.4249 160.0091 162.5317 195.5013 206.0367 219.0817 240.5787 263.9797 270.1072 285.7480 298.6316 312.6800 318.6776 330.3095 337.9165 355.6218 360.0651 368.6836 377.5637 406.8439 413.9023 429.2718 439.6367 464.3245 473.5103 485.0947 510.9396 527.6372 543.8757 570.4614 586.4995 615.7750 625.4261 665.0505 680.1331 699.7754 709.8811 723.6001 750.3934 753.3506 760.6719 766.3548 787.3470 799.4751 801.2440 818.6807 825.5916 836.6592 850.4727 854.0450 874.6361 900.9016 909.7429 916.1244 930.3445 931.6995 957.6601 964.9854 972.7536 984.8478 997.2308 1007.2109 1015.4070 1022.0186 1030.0296 1041.6290 1044.3144 1051.2165 1059.0611 1072.2653 1075.6930 1086.9675 1100.2695 1109.3257 1114.3114 1124.8025 1132.7751 1141.7645 1149.4778 1152.6255 1174.5532 1179.8339 1196.6325 1210.8872 1214.9468 1226.6846 1234.2523 1246.6930 1253.8074 1255.6227 1262.9418 1274.2526 1277.4168 1284.0956 1287.3524 1293.8952 1307.8653 1308.7168 1316.9317 1335.3529 1341.5295 1350.6988 1354.3917 1359.3952 1370.5566 1374.0587 1377.5305 1380.4223 1396.1756 1402.5691 1429.2803 1450.0585 1454.3050 1457.3349 1459.5417 1461.1741 1468.8341 1470.5292 1473.7302 1475.1325 1483.0852 1487.4519 1556.3218 1577.8944 1581.1262 1609.7204 2864.4099 2872.1434 2885.6631 2900.0309 2954.8767 2978.0553 2991.1080 2997.3684 3001.5176 3013.0864 3015.9071 3023.4026 3027.7794 3043.7743 3050.4136 3053.8206 3067.5627 3082.5589 3084.9436 3090.0165 3133.2024 3142.9245 3149.4397 3159.5689 3171.8534 3178.6128 3182.2042 3560.7047
redmass: 6.3536 5.9851 4.2725 4.4876 7.9958 2.6099 3.7239 4.2159 5.9855 4.0245 4.1128 5.6111 4.0564 1.8943 4.4970 3.9388 4.2042 3.9729 4.9948 4.1268 3.0206 3.8743 3.0923 1.4943 2.1446 3.4641 3.2384 4.3490 2.8213 2.6624 3.0131 4.4343 4.3938 3.2875 3.7017 4.6786 3.5436 3.5392 3.9033 4.1514 6.5760 4.5563 4.9136 3.0091 5.8884 5.5612 3.2503 4.6732 3.6192 3.5023 1.4684 4.0133 5.1747 1.7829 1.3279 1.2217 2.1628 1.9619 2.3218 1.3914 1.4551 2.8470 4.2208 2.7876 1.8612 1.3747 1.3403 3.7345 2.1970 1.3139 2.4808 2.2478 2.5670 3.2267 2.8298 3.2848 2.4129 2.1050 2.0871 2.2044 2.1758 2.0392 1.9647 2.8779 2.5531 2.1851 1.5751 1.7913 1.4331 1.6956 1.7081 1.0696 1.1319 1.3344 1.4316 1.4386 1.7060 1.7004 1.4298 1.6866 1.3644 1.3047 1.5506 1.4343 1.2939 1.3565 1.3050 1.5257 1.5343 1.7422 1.3059 1.6053 1.3713 1.4854 1.4691 2.3845 1.9455 1.3356 7.9457 1.3680 2.7735 2.3303 1.0830 2.6202 1.0809 1.1043 1.0878 1.0911 1.0915 2.2980 1.0956 1.0868 1.2055 6.6016 6.7990 7.4217 7.3919 1.0702 1.0685 1.0687 1.0688 1.0687 1.0674 1.0637 1.0885 1.0615 1.0897 1.0645 1.0892 1.0899 1.0868 1.0976 1.0886 1.1016 1.0920 1.0986 1.1042 1.0852 1.0903 1.0897 1.0937 1.1002 1.0920 1.0960 1.0662
irintensity: 0.2922 0.6439 1.2682 0.1619 0.1195 2.9522 2.1715 1.0704 1.3566 2.3001 0.4853 0.3164 1.7641 0.5725 4.7668 0.4944 2.3441 0.6686 2.0239 4.3245 4.3155 14.9147 30.1230 93.3960 5.1498 11.1654 27.0599 4.2202 8.5161 4.3058 3.0003 2.5880 8.8715 0.4361 4.0777 16.9356 4.4482 2.1030 2.4275 6.0097 11.1786 2.2752 3.8768 7.1833 5.2119 1.8477 23.8491 1.6557 11.2950 19.4853 83.4424 4.9332 11.7402 5.2666 36.2807 8.6997 33.1063 1.2633 2.2761 2.1108 31.1192 2.9331 76.3896 1.7366 2.8358 2.9836 0.5243 90.4763 11.6678 0.2437 12.2671 19.4186 25.0201 9.7200 56.5446 5.2173 6.7413 4.7711 9.8872 7.2817 9.9214 17.8274 28.4161 11.9450 10.2191 13.7725 20.2597 52.7377 9.3726 20.1136 22.9982 0.1581 4.2601 4.8432 17.3616 39.6245 16.3201 46.0627 18.8315 22.0479 4.0292 13.6677 3.5075 8.2528 4.9932 3.1347 14.2388 11.9697 2.1295 74.3731 3.8701 25.4524 8.7021 8.6008 10.6218 2.9599 18.3432 1.5246 10.1806 1.2833 32.1272 5.7741 4.6157 358.3395 0.6688 8.2260 9.6482 5.2908 3.4685 27.4930 23.0644 6.1791 13.2014 45.9114 4.2295 76.9371 37.6225 54.4731 41.5873 137.5307 74.1538 47.0770 57.9340 36.7623 24.9732 17.4066 35.9237 61.1373 44.1576 6.7875 57.8945 50.3243 18.7608 0.1207 6.4259 36.2178 60.1784 1.4095 7.8964 2.9586 21.1521 18.4643 2.6916 0.8994 7.4183
temp: 298.150 k
press: 1.00000 atm
elementType: 17 16 8 7 7 7 6 6 6 6 6 6 6 6 6 6 6 6 6 6 6 6 6 6 6 6 6 6 6 1 1 1 1 1 1 1 1 1 1 1 1 1 1 1 1 1 1 1 1 1 1 1 1 1 1 1 1
symmnumber: 1
zpe: 1227766.5 jmol-1
zpe.correction: 0.467632 hartree
zpe.thermalcorrener: 0.494497 hartree
zpe.thermalcorrenthalpy: 0.495442 hartree
zpe.thermalcorrgfe: 0.406224 hartree
zpe.sumelectzpe: -1988.653034 hartree
zpe.sumelectthermal: -1988.626168 hartree
zpe.sumelectthermalent: -1988.625224 hartree
zpe.sumelectthermalfe: -1988.714441 hartree
dipole: 1.4045 0.7572 1.2122
dipole: 2.0038
quadrupole: -209.7616 -178.6967 -187.1600
quadrupole: 2.8387 4.5155 1.9015
quadrupole: -17.8888 13.1760 4.7128 2.8387 4.5155 1.9015
hfenergy: -1989.1206652 hartree
pointgroup: C01 [X(C23H28Cl1N3O1S1)]
dipole: 0.5633368 0.1629254 0.5269138 debye
polarizability: 348.1068344|72.382387|289.0410236|-14.6720858|33.6223121|250.9797691 unknown
InChI: InChI=1S/C23H28ClN3OS/c24-17-6-9-23-21(14-17)27(20-4-1-2-5-22(20)29-23)11-3-10-26-18-7-8-19(26)16-25(15-18)12-13-28/h1-2,4-6,9,14,18-19,28H,3,7-8,10-13,15-16H2
charge 0 multiplicity 1
57 atoms
Cl -6.127349 -2.180798 -1.785573
S  -2.577307 1.359924 2.261652
O  7.674284 0.396839 -1.332771
N  1.453557 -1.354304 0.11088
N  4.257992 -0.607832 0.016805
N  -1.707889 0.360542 -0.497079
C  2.482135 -2.27939 -0.471893
C  2.173117 -0.889997 1.342652
C  3.008216 -3.126865 0.740561
C  2.797801 -2.18456 1.970568
C  3.604961 -1.394463 -1.061529
C  3.268826 0.094523 0.877487
C  0.119906 -1.964864 0.349824
C  5.337487 0.277057 -0.46809
C  -0.749305 -1.931252 -0.927839
C  -0.949029 -0.489373 -1.44842
C  6.618259 -0.501633 -0.838177
C  -3.042813 0.002795 -0.157088
C  -1.229124 1.674455 -0.189808
C  -3.628014 0.454266 1.060701
C  -1.590337 2.306419 1.032379
C  -3.836115 -0.797541 -1.025327
C  -0.403878 2.398816 -1.092352
C  -4.961526 0.144072 1.387308
C  -1.152093 3.607913 1.344471
C  -5.150575 -1.127717 -0.654438
C  0.069312 3.68762 -0.76429
C  -5.743536 -0.67231 0.536129
C  -0.301371 4.301285 0.452739
H  2.041715 -2.895825 -1.275224
H  1.473627 -0.366259 2.016817
H  4.071162 -3.389048 0.607901
H  2.432024 -4.064374 0.84248
H  2.105481 -2.629372 2.708179
H  3.751988 -1.964101 2.477893
H  3.154609 -0.73232 -1.843007
H  4.363388 -2.033845 -1.550388
H  3.805215 0.508276 1.753202
H  2.765205 0.938937 0.345762
H  0.17965 -3.016344 0.718283
H  -0.384746 -1.373077 1.136629
H  5.026597 0.892497 -1.34894
H  5.583801 0.987379 0.34775
H  -0.259774 -2.512259 -1.734869
H  -1.716195 -2.425869 -0.71989
H  -1.416303 -0.492678 -2.455633
H  0.061627 -0.060279 -1.536625
H  6.9563 -1.092856 0.037874
H  6.441054 -1.190985 -1.679394
H  7.935218 1.016495 -0.605277
H  -3.437272 -1.148023 -1.979474
H  -0.140468 1.96239 -2.059843
H  -5.389812 0.520948 2.321582
H  -1.46415 4.068943 2.287596
H  0.713463 4.218252 -1.473907
H  -6.76979 -0.941751 0.796893
H  0.055394 5.30522 0.703747
