program: Gaussian 09
title: 000201252
version: EM64L-G09RevD.01
frameworkgroup: C1[X(C15H13N3O)]
method: RPBEPBE
basis: SDD
operation: Freq
keyword: #p
keyword: freq=noraman
keyword: PBEPBE/SDD
title: #p freq=noraman PBEPBE/SDD
converged: YES YES NO NO
title: Mulliken charges:
elementType: O N N N C C C C C C C C C C C C C C C H H H H H H H H H H H H H
charge: -0.261184 -0.140954 -0.154567 -0.606173 -0.475134 0.485329 0.487450 0.192437 -0.413146 -0.415333 -0.373772 -0.371677 -0.228678 -0.228268 -0.233346 -0.232929 -0.243333 -0.243361 0.177151 0.237829 0.219176 0.219463 0.277100 0.274610 0.223974 0.224115 0.226336 0.226387 0.227948 0.228020 0.350175 0.344354
chargesum: 0.00000
title: Mulliken charges with hydrogens summed into heavy atoms:
elementType: O N N N C C C C C C C C C C C C C C C
charge: -0.261184 -0.140954 -0.154567 0.088356 -0.237304 0.485329 0.487450 0.192437 -0.193969 -0.195870 -0.096673 -0.097067 -0.004704 -0.004153 -0.007010 -0.006542 -0.015385 -0.015342 0.177151
polarizability: 1.89238414e+02 8.81816471e-02 1.77064816e+02 9.70000225e+00 -1.07426330e+00 1.64238754e+02
1716.lowfreq: -7.1453 -0.0006 -0.0005 -0.0003 1.0574 2.8822 7.8124 23.8267 44.7221
frequency: -6.7392 23.5977 44.7081 55.3623 81.5569 101.0535 168.7123 216.5184 222.8860 250.4532 264.5049 280.4304 294.3135 361.3796 396.3858 400.5538 405.5704 433.2996 471.4258 507.2284 574.5090 614.5792 615.0209 628.5247 660.2860 693.4405 700.3829 701.4597 709.4625 753.5286 756.4366 793.0063 837.3000 838.1085 849.2893 856.4487 868.5823 889.4327 919.1066 935.2946 941.1080 976.1783 980.6803 989.4622 990.6357 996.7092 1000.7917 1027.6726 1028.3209 1039.5804 1079.5217 1090.8288 1097.0937 1172.1057 1172.3338 1179.9658 1185.0686 1192.8166 1197.5792 1224.0799 1293.0788 1331.8576 1334.4663 1366.8826 1381.5733 1390.8154 1440.2702 1443.7003 1478.7794 1483.3705 1513.2552 1577.7887 1593.0481 1594.9880 1607.4047 1612.4245 1643.4935 3027.7368 3112.4978 3115.0775 3125.8994 3126.9084 3137.4708 3138.9436 3147.9492 3149.9608 3163.1871 3163.9246 3580.6181 3727.9374
redmass: 4.5402 4.6019 4.2413 4.6984 8.4969 4.9949 5.0710 5.2682 5.1536 4.4171 3.3561 6.3184 1.7758 2.3220 3.6905 2.8041 2.8708 1.2555 3.4879 3.6724 6.0421 6.3959 6.4903 4.8112 10.6224 7.8808 1.9343 7.2169 1.6913 1.8190 2.4658 4.9753 3.3702 3.6660 1.2950 1.2793 10.0094 10.4606 1.4092 1.5637 3.7941 1.3954 1.3858 5.7912 5.6432 1.3296 1.3272 2.4706 2.2451 3.0400 1.6365 1.6486 3.2304 1.0787 1.1459 2.2529 2.3082 1.1168 1.1224 1.5131 1.9359 1.6123 1.2437 2.5852 7.3593 4.1454 2.1386 2.1686 2.1813 2.2055 9.3230 1.4484 6.0219 6.1234 5.9724 5.9738 3.3766 1.0833 1.0874 1.0870 1.0863 1.0867 1.0916 1.0919 1.0959 1.0956 1.1015 1.1015 1.0448 1.1058
irintensity: 3.0891 3.8214 0.0254 0.2696 3.3455 4.7580 0.0011 2.1097 4.0609 1.3805 6.5263 1.2672 36.8752 52.0685 2.3480 0.0356 0.2658 246.9164 4.9899 11.5367 16.6687 0.0193 0.5655 25.9989 8.8121 7.3422 26.7190 1.8250 82.4879 36.8282 39.6554 16.4148 0.3288 0.4454 0.0047 1.0605 9.9164 60.9748 0.8210 0.7428 5.4528 0.0041 0.4884 0.3971 0.6128 0.0049 1.4479 6.0015 12.6828 9.8603 1.2674 23.3466 24.4715 0.0236 0.5113 0.4600 0.1353 1.9088 1.8208 2.7137 19.1845 2.3817 3.1944 11.6988 0.0171 0.6489 0.9834 24.0896 36.8859 16.5409 55.6181 13.6351 0.0362 3.5948 16.4678 6.0250 558.2605 6.7661 10.1582 7.3369 0.4833 1.7262 6.3370 40.0958 2.1652 27.3960 41.0819 22.0787 151.3610 65.1794
temp: 298.150 k
press: 1.00000 atm
elementType: 8 7 7 7 6 6 6 6 6 6 6 6 6 6 6 6 6 6 6 1 1 1 1 1 1 1 1 1 1 1 1 1
symmnumber: 1
zpe: 649225.2 jmol-1
zpe.correction: 0.247277 hartree
zpe.thermalcorrener: 0.262313 hartree
zpe.thermalcorrenthalpy: 0.263258 hartree
zpe.thermalcorrgfe: 0.203703 hartree
zpe.sumelectzpe: -817.514286 hartree
zpe.sumelectthermal: -817.499249 hartree
zpe.sumelectthermalent: -817.498305 hartree
zpe.sumelectthermalfe: -817.557859 hartree
dipole: 1.4993 0.0594 -3.7469
dipole: 4.0362
quadrupole: -86.6863 -106.0843 -104.6919
quadrupole: -0.1026 -10.2036 0.0905
quadrupole: 12.4679 -6.9302 -5.5377 -0.1026 -10.2036 0.0905
hfenergy: -817.7615626 hartree
pointgroup: C01 [X(C15H13N3O1)]
dipole: -0.4623595 0.3934583 1.4673204 debye
polarizability: 184.4092467|-5.8153022|181.6737405|8.5165698|-5.3112704|164.4589977 unknown
InChI: InChI=1S/C15H13N3O/c16-15-18-17-14(19-15)13(11-7-3-1-4-8-11)12-9-5-2-6-10-12/h1-10,13H,16H2
charge 0 multiplicity 1
32 atoms
O  -2.100969 1.518008 0.984721
N  -1.578772 1.074572 -1.191582
N  -2.731424 1.951779 -1.183785
N  -3.978739 2.939508 0.668402
C  -0.119666 0.013006 0.65176
C  -0.23617 -1.487123 0.298999
C  1.279451 0.559847 0.286437
C  -1.230329 0.835978 0.063495
C  0.060856 -2.450167 1.294837
C  2.285069 0.596118 1.28361
C  -0.582681 -1.92561 -1.003089
C  1.596661 0.97805 -1.029655
C  0.019123 -3.83085 0.99736
C  3.591434 1.036659 0.973409
C  -0.625762 -3.30596 -1.299808
C  2.902096 1.419565 -1.339157
C  -0.323488 -4.263668 -0.304007
C  3.904757 1.44861 -0.341875
C  -2.9914 2.177105 0.111431
H  -0.231674 0.102564 1.747912
H  0.328356 -2.121571 2.307178
H  2.048733 0.277534 2.3068
H  -0.835152 -1.188823 -1.773299
H  0.818975 0.974354 -1.801152
H  0.24959 -4.564328 1.77832
H  4.359005 1.061071 1.75522
H  -0.897796 -3.633531 -2.309596
H  3.135882 1.74308 -2.359755
H  -0.358059 -5.333653 -0.537889
H  4.916441 1.791828 -0.585682
H  -4.628789 3.418985 0.052861
H  -4.062461 3.026261 1.676177
