program: Gaussian 09
title: 000201239
version: EM64L-G09RevD.01
frameworkgroup: C1[X(C17H15NO2)]
method: RPBEPBE
basis: SDD
operation: Freq
keyword: #p
keyword: freq=noraman
keyword: PBEPBE/SDD
title: #p freq=noraman PBEPBE/SDD
converged: YES YES NO NO
title: Mulliken charges:
elementType: O O N C C C C C C C C C C C C C C C C C H H H H H H H H H H H H H H H
charge: -0.203784 -0.186766 -0.311873 0.057168 -0.610448 0.117467 0.409064 -0.717190 0.132756 0.485317 -0.391121 -0.383191 -0.232833 -0.249486 -0.346120 -0.342973 -0.239097 -0.222200 -0.222419 -0.239634 0.260121 0.280131 0.255245 0.224517 0.236529 0.287585 0.239899 0.227934 0.227252 0.268707 0.266401 0.230911 0.230466 0.230225 0.231440
chargesum: 0.00000
title: Mulliken charges with hydrogens summed into heavy atoms:
elementType: O O N C C C C C C C C C C C C C C C C C
charge: -0.203784 -0.186766 -0.311873 0.057168 -0.070196 0.117467 0.409064 -0.000899 0.132756 0.485317 -0.103536 -0.143292 -0.004900 -0.022234 -0.077414 -0.076572 -0.008186 0.008266 0.007807 -0.008194
polarizability: 2.63208741e+02 1.58682237e+00 1.93839827e+02 1.02899702e+01 -1.24545538e+00 1.09117412e+02
1716.lowfreq: -4.8518 -0.0009 -0.0006 0.0005 4.2747 9.2300 19.5177 30.3045 51.1366
frequency: 19.4626 30.0458 51.1307 73.6416 85.5421 124.2644 153.1933 175.0655 225.1428 235.2150 258.9664 277.6139 289.8557 309.7339 327.7319 379.4400 394.9400 403.8704 405.0806 475.2190 501.9007 536.9267 572.9145 598.0783 612.2337 617.5654 631.8688 655.5493 681.6469 693.0393 708.9880 717.6316 765.2477 772.3380 785.5057 838.2084 859.1537 875.3481 906.7829 915.6673 930.6513 955.3222 971.0323 983.9880 989.5358 990.1503 991.2931 995.1984 1002.3967 1028.5904 1030.5808 1057.0360 1074.2818 1084.9096 1096.7594 1133.2501 1162.4651 1174.0973 1175.6889 1183.7793 1191.0927 1196.1645 1203.8277 1231.0346 1288.8673 1326.5267 1328.6923 1330.9793 1375.7878 1384.9112 1386.2929 1434.6861 1443.0220 1445.8416 1466.3594 1473.8330 1485.4840 1488.0215 1588.3345 1595.1896 1611.1570 1612.3755 1624.9776 1687.9883 2983.1075 3018.5361 3081.3624 3083.6250 3104.3626 3120.3273 3130.0248 3132.6719 3142.5302 3145.5990 3158.9495 3162.7507 3169.7635 3185.6691 3189.8163
redmass: 4.9906 4.6607 4.0589 5.2692 4.6932 3.4900 7.2070 5.1595 3.4254 5.1606 1.0529 4.6654 3.9991 4.0194 6.9586 3.4961 4.5998 2.8972 2.8357 7.2478 3.3467 3.4165 3.6061 9.2859 6.2800 6.4354 5.5553 3.8953 5.8851 1.9136 1.9368 4.3603 2.0095 2.0044 3.7165 1.2531 1.2449 2.8362 2.9323 1.4413 1.3980 1.7910 1.3985 1.3647 3.9908 5.6402 4.0353 1.4552 1.3263 2.4651 2.1918 2.4116 2.0881 1.6676 1.7402 3.4145 3.5331 1.1073 1.0491 1.7578 2.0309 1.1738 1.2432 2.0604 2.1356 1.4696 1.5103 3.0668 6.6766 9.3791 1.1897 2.2536 1.7613 1.2753 1.0611 1.0943 2.0548 2.2407 6.0164 6.4299 6.0186 5.8964 11.4906 12.3668 1.0349 1.0618 1.1006 1.1004 1.1009 1.0854 1.0877 1.0855 1.0935 1.0907 1.0968 1.0969 1.0984 1.0949 1.0970
irintensity: 0.0568 0.4029 0.1695 2.9856 2.5716 1.0300 4.9841 0.7980 1.7542 1.1069 0.3973 1.2296 2.4851 5.1966 4.2710 0.8548 2.3170 0.1531 0.4244 8.7868 10.1978 11.3600 4.1304 15.3075 1.8527 0.3663 18.0129 2.7892 10.1988 43.1376 45.8402 23.9465 36.7658 59.7817 10.4857 0.0259 0.2184 14.9381 14.1522 4.6829 6.0164 2.9045 0.0218 0.2115 2.4697 1.1991 0.4877 1.9863 0.7605 28.8827 3.1079 3.8504 32.9848 22.4507 20.9769 119.5039 38.4567 4.3551 0.1009 26.9158 68.9689 1.8311 9.9220 3.7271 15.1874 30.7761 48.3346 218.0681 3.0212 0.7270 20.9363 15.4228 13.1145 12.0321 5.3698 3.1005 93.2054 34.4118 2.8258 18.1799 22.2500 5.5867 406.7422 33.4385 20.7916 4.7782 13.7418 24.4256 9.0631 6.4902 4.2478 0.0207 30.4231 17.3578 15.7837 33.8753 20.9120 3.7888 0.8697
temp: 298.150 k
press: 1.00000 atm
elementType: 8 8 7 6 6 6 6 6 6 6 6 6 6 6 6 6 6 6 6 6 1 1 1 1 1 1 1 1 1 1 1 1 1 1 1
symmnumber: 1
zpe: 723521.2 jmol-1
zpe.correction: 0.275575 hartree
zpe.thermalcorrener: 0.292333 hartree
zpe.thermalcorrenthalpy: 0.293277 hartree
zpe.thermalcorrgfe: 0.229702 hartree
zpe.sumelectzpe: -860.635614 hartree
zpe.sumelectthermal: -860.618855 hartree
zpe.sumelectthermalent: -860.617911 hartree
zpe.sumelectthermalfe: -860.681486 hartree
dipole: -1.6114 0.1616 0.4689
dipole: 1.6860
quadrupole: -99.6732 -114.4635 -121.4781
quadrupole: -6.8885 4.3181 8.6170
quadrupole: 12.1984 -2.5919 -9.6065 -6.8885 4.3181 8.6170
hfenergy: -860.9111882 hartree
pointgroup: C01 [X(C17H15N1O2)]
dipole: -0.6403207 0.0632383 0.1612244 debye
polarizability: 262.2075366|9.4814992|188.7014338|11.3053376|-21.1968646|115.2570099 unknown
InChI: InChI=1S/C17H15NO2/c1-17(13-8-4-2-5-9-13)12-15(19)18(16(17)20)14-10-6-3-7-11-14/h2-11H,12H2,1H3
charge 0 multiplicity 1
35 atoms
O  0.185753 -1.07466 1.401135
O  1.357238 2.357341 -1.590274
N  1.091687 0.50229 -0.117907
C  -1.267295 0.714602 0.403908
C  -0.880152 1.695639 -0.737451
C  0.032764 -0.099863 0.628549
C  -2.508043 -0.144063 0.078894
C  -1.530205 1.486858 1.740989
C  0.633384 1.612817 -0.891845
C  2.467315 0.061542 -0.064497
C  -2.662867 -1.473895 0.548458
C  -3.580636 0.448502 -0.639989
C  -3.848543 -2.195408 0.280708
C  -4.767143 -0.270663 -0.90154
C  3.511699 1.017577 -0.033515
C  2.761666 -1.323588 -0.047536
C  -4.905202 -1.600975 -0.44469
C  4.852447 0.579846 0.011383
C  4.106455 -1.747135 0.006038
C  5.156113 -0.800554 0.033886
H  -1.174153 2.740453 -0.541995
H  -1.326939 1.401837 -1.704255
H  -1.66968 0.772931 2.570013
H  -0.685101 2.155341 1.990184
H  -2.44643 2.094696 1.642727
H  -1.857651 -1.940552 1.122827
H  -3.499567 1.482074 -0.997082
H  -3.94547 -3.224692 0.644243
H  -5.580001 0.207224 -1.459868
H  3.280338 2.084607 -0.06116
H  1.952052 -2.056609 -0.063221
H  -5.82324 -2.16324 -0.648257
H  5.658896 1.320724 0.03017
H  4.331799 -2.81886 0.023125
H  6.198513 -1.134941 0.071944
