program: Gaussian 09
title: 000201237
version: EM64L-G09RevD.01
frameworkgroup: C1[X(C18H18N2O)]
method: RPBEPBE
basis: SDD
operation: Freq
keyword: #p
keyword: freq=noraman
keyword: PBEPBE/SDD
title: #p freq=noraman PBEPBE/SDD
converged: YES YES NO NO
title: Mulliken charges:
elementType: O N N C C C C C C C C C C C C C C C C C C H H H H H H H H H H H H H H H H H H
charge: -0.273079 -0.370122 -0.471324 -0.303208 0.181748 0.146755 -0.472159 -0.437228 0.188392 0.185108 0.453497 -0.579750 -0.343779 -0.484864 -0.354336 0.309327 -0.353273 -0.226857 -0.232464 -0.242998 -0.537104 0.214083 0.203355 0.225293 0.191797 0.215407 0.268758 0.312953 0.244972 0.231483 0.239903 0.270037 0.245167 0.226453 0.226208 0.228997 0.215923 0.216810 0.240117
chargesum: 0.00000
title: Mulliken charges with hydrogens summed into heavy atoms:
elementType: O N N C C C C C C C C C C C C C C C C C C
charge: -0.273079 -0.101364 -0.158371 -0.089125 0.181748 0.146755 -0.043512 -0.030024 0.188392 0.185108 0.453497 -0.334778 -0.112295 -0.244962 -0.084299 0.309327 -0.108105 -0.000404 -0.006256 -0.014001 0.135746
polarizability: 2.94888294e+02 -1.42862662e+01 2.00107596e+02 -1.24319651e+01 8.22320056e+00 1.47520956e+02
1716.lowfreq: -7.0090 -6.5587 -3.2016 -0.0008 -0.0007 -0.0003 25.7448 31.3132 46.1904
frequency: 25.7156 31.3005 46.1770 79.4089 96.8030 130.6897 143.0072 180.5727 202.4152 209.8384 250.1679 269.7635 282.2989 292.5144 327.9836 364.4644 381.2077 404.7414 427.4702 436.2384 476.4101 490.4979 505.7654 524.6290 549.2940 578.9805 597.0581 615.9693 624.4137 636.4558 665.1593 704.5636 711.6645 745.9748 753.6819 773.9517 801.5479 806.6533 826.3733 836.3329 843.9684 859.2767 903.0740 912.6171 931.2661 933.0050 980.6146 984.3110 991.0169 997.1406 997.8413 1014.7433 1024.8295 1055.3913 1077.5224 1111.9033 1113.5455 1132.0874 1145.1618 1156.1445 1171.0762 1179.0164 1184.2370 1193.6114 1205.7417 1217.8993 1229.5218 1246.3472 1260.9535 1283.8990 1295.4768 1314.0777 1334.5876 1338.4343 1370.9277 1387.0232 1409.6260 1428.8878 1438.7506 1442.1175 1452.3456 1457.6033 1462.5727 1469.0489 1474.0100 1476.9024 1479.9671 1481.9523 1580.6258 1593.7953 1599.8316 1610.9057 1634.0973 2803.6895 2871.7528 2948.1871 2966.5563 3016.4838 3030.7338 3044.9828 3109.6524 3116.2003 3125.8808 3134.5630 3138.6215 3152.8311 3153.9673 3164.5228 3170.4060 3469.0961 3598.3066
redmass: 3.9094 4.7746 4.3613 3.4458 4.2615 4.1573 3.7063 2.6290 3.1397 3.7466 1.4553 3.7401 3.1201 4.3371 2.8976 5.6109 5.7927 2.8215 2.7965 4.2388 2.9904 3.5071 1.2337 3.7071 3.4447 3.6048 4.5999 6.3246 3.5098 2.1456 5.8078 2.5027 2.0051 3.3012 2.6785 2.4899 1.5602 4.3258 4.5179 2.1605 2.3519 1.2472 2.5041 2.5311 1.3337 1.5789 1.3876 4.3175 6.1925 2.8893 1.3876 2.4602 2.1059 1.9098 1.5946 1.2775 1.6899 2.0457 3.4692 1.5263 1.0622 1.1380 1.4097 1.9248 2.1005 1.3873 1.3531 2.0254 1.3227 1.7574 1.4786 3.0592 1.5028 1.6786 1.5674 6.1046 3.9286 1.3816 1.5082 2.0375 2.1857 1.1893 1.0518 1.2556 1.2111 3.0651 2.3538 2.6508 7.3948 6.1428 6.6319 6.1398 7.2453 1.0792 1.0713 1.0334 1.0596 1.1004 1.1034 1.0905 1.0879 1.0985 1.0863 1.0894 1.0917 1.0953 1.0910 1.1007 1.0952 1.0755 1.0803
irintensity: 0.0586 0.3781 0.0890 4.7153 1.3380 1.1149 4.6834 1.2132 1.4390 3.3326 0.1168 3.5608 0.5330 0.3870 2.8445 1.1271 1.7275 0.2029 2.0222 3.9558 12.7611 12.2301 94.4168 29.4409 4.7196 9.5175 5.7326 0.5908 7.9236 63.0550 1.6361 15.8061 55.2349 8.2021 17.5033 13.8792 53.8191 40.3575 3.4013 21.1894 17.8368 0.0704 1.4908 15.7301 0.0603 5.2136 0.1202 4.4027 1.4936 34.7563 3.7676 3.8339 12.4269 1.2205 10.8404 1.6999 24.3053 58.1186 12.1045 4.4735 0.7715 16.7080 43.2606 106.2014 0.2918 24.4424 8.1367 16.7310 32.4414 8.2589 34.4351 11.2908 14.2092 10.3863 21.1963 0.9311 52.8756 14.4551 7.1565 11.5994 33.4330 30.8977 11.9375 18.7594 29.3473 64.2738 32.2932 7.3119 7.8720 3.1249 34.4416 4.6333 40.6225 75.8500 120.2323 65.7986 47.2141 37.1678 56.7275 58.9467 9.2005 34.8256 0.4420 10.4994 23.6780 27.7949 10.1226 22.0769 9.1035 0.3671 53.7648
temp: 298.150 k
press: 1.00000 atm
elementType: 8 7 7 6 6 6 6 6 6 6 6 6 6 6 6 6 6 6 6 6 6 1 1 1 1 1 1 1 1 1 1 1 1 1 1 1 1 1 1
symmnumber: 1
zpe: 835567.2 jmol-1
zpe.correction: 0.318251 hartree
zpe.thermalcorrener: 0.335810 hartree
zpe.thermalcorrenthalpy: 0.336754 hartree
zpe.thermalcorrgfe: 0.271931 hartree
zpe.sumelectzpe: -879.943806 hartree
zpe.sumelectthermal: -879.926247 hartree
zpe.sumelectthermalent: -879.925302 hartree
zpe.sumelectthermalfe: -879.990126 hartree
dipole: 2.3019 1.5237 -0.6320
dipole: 2.8319
quadrupole: -115.4023 -111.8461 -120.7306
quadrupole: -13.1283 -6.3982 2.1653
quadrupole: 0.5907 4.1469 -4.7376 -13.1283 -6.3982 2.1653
hfenergy: -880.2620564 hartree
pointgroup: C01 [X(C18H18N2O1)]
dipole: -0.9050196 0.5608631 0.3282235 debye
polarizability: 293.2912827|16.8048552|201.677666|-16.4712226|-4.779353|147.5478966 unknown
InChI: InChI=1S/C18H18N2O/c1-21-13-7-8-16-15(11-13)14-9-10-19-17(18(14)20-16)12-5-3-2-4-6-12/h2-8,11,17,19-20H,9-10H2,1H3
charge 0 multiplicity 1
39 atoms
O  5.359465 -0.647548 -0.632155
N  -1.889451 2.323231 0.282932
N  -0.063474 -0.915233 0.716074
C  -1.833738 0.952938 0.854657
C  -0.440689 0.42657 0.580692
C  0.660819 1.1904 0.197012
C  0.555668 2.67941 -0.022377
C  -0.744011 3.194572 0.646299
C  1.782759 0.282116 0.072903
C  1.299453 -1.033962 0.402649
C  -2.928687 0.065213 0.253897
C  3.14943 0.46157 -0.280499
C  2.145006 -2.164394 0.379199
C  -3.746372 -0.733133 1.089804
C  -3.117546 0.015525 -1.150736
C  3.986171 -0.673245 -0.299608
C  3.491714 -1.973538 0.025376
C  -4.738531 -1.575954 0.533801
C  -4.108232 -0.820942 -1.706708
C  -4.920824 -1.621719 -0.866571
C  5.934056 0.648793 -0.980122
H  -1.986841 0.958705 1.967433
H  1.425804 3.214041 0.408292
H  0.529648 2.914896 -1.105221
H  -0.581809 3.238047 1.752088
H  -0.971094 4.21888 0.299642
H  -2.801842 2.762361 0.454692
H  -0.705075 -1.683462 0.903036
H  3.524896 1.458029 -0.531297
H  1.776206 -3.165455 0.628171
H  -3.61629 -0.686073 2.179036
H  -2.48607 0.646504 -1.785187
H  4.193396 -2.812137 -0.009492
H  -5.368786 -2.186666 1.190159
H  -4.249577 -0.852708 -2.793116
H  -5.690023 -2.270511 -1.300632
H  5.858646 1.365691 -0.137815
H  5.44363 1.083172 -1.874429
H  6.993393 0.448414 -1.200579
