program: Gaussian 09
title: 000201235
version: EM64L-G09RevD.01
frameworkgroup: C1[X(C17H17N3O)]
method: RPBEPBE
basis: SDD
operation: Freq
keyword: #p
keyword: freq=noraman
keyword: PBEPBE/SDD
title: #p freq=noraman PBEPBE/SDD
converged: YES YES NO NO
title: Mulliken charges:
elementType: O N N N C C C C C C C C C C C C C C C C C H H H H H H H H H H H H H H H H H
charge: -0.271803 -0.374881 -0.472820 -0.002311 -0.287785 0.178787 0.148951 -0.472530 -0.436607 0.189864 0.187779 0.470357 -0.578314 -0.342300 0.309536 -0.414908 -0.305687 -0.350956 -0.335303 -0.344742 -0.536898 0.218124 0.205846 0.227294 0.194751 0.217936 0.270665 0.313705 0.245737 0.232974 0.241946 0.271068 0.246911 0.239979 0.240406 0.216334 0.217394 0.241500
chargesum: 0.00000
title: Mulliken charges with hydrogens summed into heavy atoms:
elementType: O N N N C C C C C C C C C C C C C C C C C
charge: -0.271803 -0.104216 -0.159115 -0.002311 -0.069661 0.178787 0.148951 -0.039389 -0.023920 0.189864 0.187779 0.470357 -0.332577 -0.109325 0.309536 -0.172961 -0.034619 -0.104045 -0.095325 -0.104336 0.138331
polarizability: 2.87615297e+02 -1.04290128e+01 1.97232758e+02 -1.27837500e+01 1.11494397e+01 1.44248433e+02
1716.lowfreq: -10.4921 -6.8004 -2.7764 -0.0004 0.0004 0.0006 27.4631 31.2385 45.2675
frequency: 27.3954 31.2336 45.2586 78.4260 97.6954 130.4981 143.8476 180.4859 201.7744 209.5879 248.6470 267.9042 280.7900 292.8748 328.5709 366.3359 369.2481 381.0798 427.4500 439.4175 476.0699 490.0730 497.4249 532.6608 553.9638 579.8841 592.9421 623.3305 638.2177 658.9577 665.8335 708.8498 744.9549 751.4197 760.5686 798.3307 803.2349 824.8180 837.8241 839.3827 845.3185 893.7980 907.6057 915.7862 933.4061 958.0574 966.7401 982.2100 986.9371 997.3317 1015.5230 1055.2704 1058.0427 1077.5065 1111.9527 1114.4034 1133.4408 1146.7290 1156.3613 1184.7106 1194.4326 1203.7925 1218.4144 1219.4177 1228.2872 1246.0624 1260.2698 1277.1890 1295.8405 1314.1125 1315.6560 1337.2302 1345.1970 1371.8451 1401.4387 1410.5588 1428.9620 1441.6199 1453.0778 1457.8758 1461.8226 1462.9616 1469.3545 1473.7549 1477.1201 1481.8376 1559.6160 1580.4198 1583.3463 1600.7873 1634.2521 2807.4538 2878.6787 2949.3521 2969.1050 3019.8254 3032.4924 3047.4670 3117.9285 3118.7219 3134.2392 3135.8061 3143.6003 3155.2345 3170.7386 3171.2864 3468.1617 3599.2236
redmass: 4.2690 4.7346 4.7827 3.5202 4.3957 4.1942 3.7612 2.6885 3.3092 4.1372 1.4732 3.8720 3.0981 4.6924 2.8937 4.9308 2.7386 5.7309 2.8133 4.5135 3.0409 2.5054 1.4120 3.8949 3.4508 3.6540 4.9797 3.5253 2.1394 6.7102 5.9878 3.2846 3.4978 3.0570 3.4970 3.4874 1.5469 3.2836 1.9795 2.0523 2.4979 1.2598 3.1447 2.3510 1.3329 5.8622 1.4310 1.4712 4.5101 2.9470 2.4656 1.9063 2.1046 1.6010 1.2671 1.7096 2.0218 3.4713 1.5481 1.4115 1.9836 1.6856 1.3823 1.5828 1.3258 2.1703 1.3396 2.3822 1.4926 3.2399 3.3010 1.8130 1.3821 1.5210 1.9889 4.0671 1.3782 1.4839 2.1092 1.1916 1.9479 1.0524 1.3342 1.2094 2.6522 2.6756 6.8280 7.1254 5.8983 6.6183 7.2387 1.0794 1.0712 1.0334 1.0597 1.1003 1.1034 1.0908 1.0986 1.0875 1.0894 1.0895 1.0973 1.0910 1.0960 1.0953 1.0755 1.0804
irintensity: 0.3184 0.0549 0.5182 5.5058 1.0767 1.6378 3.4233 0.4544 2.3090 0.3691 0.3219 7.3690 0.6180 1.3477 3.0169 1.1105 0.0858 1.7757 2.1060 5.9669 11.3726 9.1404 103.7080 31.1330 7.3616 8.1726 6.3238 15.6745 61.0380 2.1009 1.1820 5.0974 6.6492 5.5689 12.4089 21.9026 39.8226 24.9121 25.1542 41.7806 16.6216 0.0155 12.6821 5.4727 0.0187 3.4189 2.0491 0.4947 15.2990 29.2606 2.4701 0.6131 11.4831 1.1386 0.6804 23.5763 55.2498 11.7361 5.0335 48.6435 115.1983 0.9199 22.1836 2.9505 7.1442 17.6991 32.1696 6.5784 31.1179 9.8715 9.0732 21.9408 5.8122 13.4101 22.6883 49.9738 14.9299 4.4225 31.8827 32.0817 6.1517 11.8642 29.4993 27.4240 62.2170 17.4646 9.3569 2.4863 69.5543 24.3810 41.6015 76.9519 113.6388 64.4856 43.7499 34.9475 55.8111 55.1603 33.6812 6.2761 26.2589 9.6492 24.4192 10.3496 4.8256 8.2543 0.2745 52.0181
temp: 298.150 k
press: 1.00000 atm
elementType: 8 7 7 7 6 6 6 6 6 6 6 6 6 6 6 6 6 6 6 6 6 1 1 1 1 1 1 1 1 1 1 1 1 1 1 1 1 1
symmnumber: 1
zpe: 804454.3 jmol-1
zpe.correction: 0.306400 hartree
zpe.thermalcorrener: 0.323869 hartree
zpe.thermalcorrenthalpy: 0.324814 hartree
zpe.thermalcorrgfe: 0.260111 hartree
zpe.sumelectzpe: -895.978497 hartree
zpe.sumelectthermal: -895.961028 hartree
zpe.sumelectthermalent: -895.960083 hartree
zpe.sumelectthermalfe: -896.024786 hartree
dipole: -0.1295 3.2624 -1.7503
dipole: 3.7045
quadrupole: -132.0955 -114.3990 -120.3224
quadrupole: -1.3721 -13.4848 6.1835
quadrupole: -9.8232 7.8733 1.9499 -1.3721 -13.4848 6.1835
hfenergy: -896.284897 hartree
pointgroup: C01 [X(C17H17N3O1)]
dipole: 0.050402 1.3213661 0.6129437 debye
polarizability: 287.3663168|9.8974602|195.8364825|-14.2454172|-14.2451384|145.8936885 unknown
InChI: InChI=1S/C17H17N3O/c1-21-12-2-3-15-14(10-12)13-6-9-19-16(17(13)20-15)11-4-7-18-8-5-11/h2-5,7-8,10,16,19-20H,6,9H2,1H3
charge 0 multiplicity 1
38 atoms
O  5.356533 -0.759403 -0.376811
N  -1.879549 2.366163 -0.029215
N  -0.095917 -0.80665 0.870433
N  -4.885484 -1.70248 -0.831378
C  -1.851129 1.076958 0.705943
C  -0.457291 0.506687 0.543084
C  0.658878 1.203133 0.082211
C  0.574511 2.648796 -0.340121
C  -0.725517 3.262785 0.235714
C  1.774934 0.279508 0.110547
C  1.272754 -0.974951 0.6069
C  -2.925081 0.125462 0.170772
C  3.150406 0.40153 -0.23276
C  2.108046 -2.103403 0.758465
C  3.977153 -0.729878 -0.076093
C  -3.728624 -0.640228 1.048525
C  -3.125662 -0.038973 -1.22201
C  3.463298 -1.97035 0.41299
C  -4.684816 -1.533717 0.50831
C  -4.10436 -0.951177 -1.670349
C  5.952166 0.471823 -0.889289
H  -2.046665 1.212743 1.803286
H  1.445892 3.227559 0.025326
H  0.564139 2.734328 -1.445052
H  -0.578717 3.447636 1.32837
H  -0.935237 4.235203 -0.244859
H  -2.785956 2.83752 0.07653
H  -0.74325 -1.539878 1.153076
H  3.540015 1.3515 -0.610125
H  1.72488 -3.058911 1.132839
H  -3.628814 -0.535753 2.135775
H  -2.52787 0.547501 -1.925891
H  4.157938 -2.809965 0.509183
H  -5.322342 -2.136921 1.165136
H  -4.284236 -1.099406 -2.741227
H  5.869685 1.29856 -0.155387
H  5.482768 0.781884 -1.844373
H  7.012818 0.233364 -1.059077
