program: Gaussian 09
title: 000201187
version: EM64L-G09RevD.01
frameworkgroup: C1[X(C16H15N3)]
method: RPBEPBE
basis: SDD
operation: Freq
keyword: #pfreq=noraman
keyword: PBEPBE/SDD
title: #p freq=noraman PBEPBE/SDD
converged: YES YES NO NO
title: Mulliken charges:
elementType: N N N C C C C C C C C C C C C C C C C H H H H H H H H H H H H H H H
charge: -0.374361 -0.479960 -0.002390 -0.284446 0.176726 0.151315 -0.471922 -0.436326 0.165444 0.203219 0.470695 -0.421737 -0.370421 -0.415280 -0.304494 -0.254188 -0.222391 -0.334879 -0.344443 0.218741 0.208337 0.228650 0.195083 0.218657 0.270641 0.314474 0.231434 0.230975 0.242015 0.271130 0.218703 0.220188 0.240125 0.240686
chargesum: 0.00000
title: Mulliken charges with hydrogens summed into heavy atoms:
elementType: N N N C C C C C C C C C C C C C C C C
charge: -0.103721 -0.165486 -0.002390 -0.065705 0.176726 0.151315 -0.034934 -0.022585 0.165444 0.203219 0.470695 -0.190303 -0.139445 -0.173265 -0.033363 -0.035485 -0.002204 -0.094755 -0.103757
polarizability: 2.45857240e+02 -4.29592388e+00 1.87476124e+02 -1.50430280e+01 1.08573456e+01 1.33639876e+02
1716.lowfreq: -6.4031 -2.7677 -0.0007 -0.0006 -0.0004 4.9571 29.1958 41.7796 52.7394
frequency: 29.0976 41.7651 52.7302 104.4920 144.7831 185.0618 192.1653 240.1616 275.1037 283.0253 300.2823 331.7929 368.9181 400.7736 427.3108 473.2098 497.1864 509.4382 532.7573 567.8088 577.5791 589.0289 599.5194 640.7550 659.6580 670.6168 724.8358 748.4548 749.8427 761.0293 767.5182 819.8463 838.5702 840.8199 851.7011 884.4707 893.6385 914.7590 929.5449 957.9731 966.4455 969.5157 979.2687 982.4593 1011.7362 1016.5580 1055.5962 1058.5884 1077.8084 1110.0534 1139.2865 1153.1012 1169.0112 1188.4280 1202.5250 1217.9252 1219.3060 1226.8568 1241.8006 1261.7076 1276.2043 1307.2461 1310.2241 1315.7372 1342.5216 1355.2240 1373.3924 1401.7840 1406.4044 1437.6893 1445.0326 1457.8624 1462.3780 1468.6354 1474.5994 1482.0355 1559.6136 1580.2026 1583.2801 1598.4705 1633.5282 2808.0797 2878.6886 2973.2942 3024.8256 3048.6554 3118.8372 3122.3891 3130.0698 3134.3329 3143.6362 3143.8792 3161.7775 3170.0821 3468.8045 3597.3194
redmass: 3.8996 5.8991 4.2118 4.6287 3.3285 4.9348 3.5798 5.2606 3.2837 4.4694 4.7413 2.7810 2.4918 5.4840 2.9401 2.7306 3.6856 1.2505 3.2763 3.6246 3.8844 3.9755 4.5276 2.8295 6.2888 4.1435 2.9111 2.8817 1.4860 3.5321 3.2234 2.7717 2.0391 2.9399 1.5399 3.6568 1.2714 2.2467 1.3852 5.9010 1.4330 1.3003 3.0645 1.5659 2.0187 2.5161 1.9049 2.1045 1.5960 1.7963 3.4777 2.3658 1.2204 1.1949 1.7350 1.3715 1.4921 1.3676 1.9679 1.3534 2.3965 2.4361 1.6105 2.9676 1.3484 1.6645 1.6323 2.0040 3.9344 2.0190 1.8905 1.1147 1.9544 1.6665 1.8976 3.0149 6.8459 6.5549 5.7654 7.0372 7.0749 1.0794 1.0713 1.0600 1.1002 1.0910 1.0876 1.0847 1.0891 1.0893 1.0972 1.0952 1.1001 1.0961 1.0755 1.0803
irintensity: 0.2918 0.4085 1.3967 1.7513 0.4724 0.4917 1.8135 0.7702 3.8420 0.5549 0.4810 2.5416 0.1158 5.3189 5.7729 16.8845 24.4685 69.5845 31.7096 19.4980 3.7591 2.4538 6.9041 53.4219 4.7553 5.5357 4.2483 40.0779 74.8666 9.2310 14.3548 20.2816 34.5432 6.7961 0.4199 1.8881 0.4604 2.2321 2.9982 3.3025 1.4929 0.0072 4.2698 1.3891 8.1934 3.4229 0.3432 10.6179 1.1688 4.1032 32.7558 11.8436 3.2128 1.8213 0.6177 8.9820 2.4335 5.2563 4.7387 30.7694 14.6060 32.7214 12.1977 5.1235 10.5341 23.3517 15.4821 21.9594 27.2271 3.4517 14.6532 9.0389 6.7239 24.1240 11.5137 3.0982 9.0615 4.8238 50.9159 1.1260 1.7550 74.5672 114.9085 40.9030 34.2416 54.2018 6.3767 1.2474 3.3161 25.7903 21.3917 38.9372 35.5688 4.8047 0.2553 48.1550
temp: 298.150 k
press: 1.00000 atm
elementType: 7 7 7 6 6 6 6 6 6 6 6 6 6 6 6 6 6 6 6 1 1 1 1 1 1 1 1 1 1 1 1 1 1 1
symmnumber: 1
zpe: 722680.5 jmol-1
zpe.correction: 0.275254 hartree
zpe.thermalcorrener: 0.289927 hartree
zpe.thermalcorrenthalpy: 0.290871 hartree
zpe.thermalcorrgfe: 0.232580 hartree
zpe.sumelectzpe: -781.628453 hartree
zpe.sumelectthermal: -781.613781 hartree
zpe.sumelectthermalent: -781.612837 hartree
zpe.sumelectthermalfe: -781.671128 hartree
dipole: -0.0924 1.9603 -2.1062
dipole: 2.8787
quadrupole: -122.9334 -101.8655 -108.3250
quadrupole: 6.5933 -8.7505 4.9094
quadrupole: -11.8921 9.1758 2.7163 6.5933 -8.7505 4.9094
hfenergy: -781.9037078 hartree
pointgroup: C01 [X(C16H15N3)]
dipole: 0.0308678 -0.8239874 -0.7764289 debye
polarizability: 246.0434595|-3.4281238|185.8258873|14.5773887|-14.2783823|135.1038933 unknown
InChI: InChI=1S/C16H15N3/c1-2-4-14-12(3-1)13-7-10-18-15(16(13)19-14)11-5-8-17-9-6-11/h1-6,8-9,15,18-19H,7,10H2
charge 0 multiplicity 1
34 atoms
N  -1.251855 -2.35964 0.056569
N  0.548946 0.822353 -0.779469
N  -4.338017 1.687338 0.625446
C  -1.19264 -1.080328 -0.693537
C  0.183266 -0.493447 -0.455146
C  1.275656 -1.169051 0.081374
C  1.182723 -2.610421 0.517072
C  -0.074218 -3.246572 -0.126464
C  2.381483 -0.230941 0.1070
C  1.895014 1.014351 -0.43817
C  -2.305816 -0.133421 -0.236079
C  3.73436 -0.313318 0.529776
C  2.71515 2.15625 -0.558261
C  -3.070839 0.604675 -1.169956
C  -2.581979 0.054333 1.140782
C  4.558003 0.823703 0.409562
C  4.053844 2.045317 -0.126891
C  -4.064875 1.495686 -0.69835
C  -3.593803 0.961892 1.519115
H  -1.319803 -1.232624 -1.798774
H  2.08102 -3.182225 0.211824
H  1.108487 -2.681218 1.620334
H  0.139129 -3.44417 -1.205769
H  -0.301919 -4.214709 0.354225
H  -2.145639 -2.842482 -0.094514
H  -0.089614 1.541205 -1.114742
H  4.13283 -1.245553 0.946206
H  2.334259 3.097605 -0.970142
H  -2.911943 0.481272 -2.248116
H  -2.0152 -0.510865 1.886479
H  5.603758 0.774113 0.733157
H  4.718488 2.912913 -0.205789
H  -4.673828 2.078198 -1.399458
H  -3.831927 1.127978 2.575901
