program: Gaussian 09
title: 000201227
version: EM64L-G09RevD.01
frameworkgroup: C1[X(C18H20N4O2S)]
method: RPBEPBE
basis: SDD
operation: Freq
keyword: #p
keyword: freq=noraman
keyword: PBEPBE/SDD
title: #p freq=noraman PBEPBE/SDD
converged: NO YES NO NO
title: Mulliken charges:
elementType: S O O N N N N C C C C C C C C C C C C C C C C C C H H H H H H H H H H H H H H H H H H H H
charge: 0.648910 -0.242359 -0.618725 -0.095600 -0.269494 -0.025109 0.068249 -0.522397 -0.339495 -0.343117 0.362508 -0.326512 -0.319526 -0.064863 -0.108112 0.319964 -0.146191 -0.368899 -0.395773 -0.195015 -0.334835 -0.245478 -0.271563 -0.202379 -0.802295 0.214989 0.259638 0.186642 0.238434 0.213101 0.199607 0.199611 0.221274 0.220461 0.193440 0.253952 0.286731 0.306146 0.238318 0.253285 0.308632 0.240870 0.289059 0.244116 0.269797
chargesum: 0.00000
title: Mulliken charges with hydrogens summed into heavy atoms:
elementType: S O O N N N N C C C C C C C C C C C C C C C C C C
charge: 0.648910 -0.242359 -0.618725 -0.095600 -0.269494 -0.025109 0.068249 -0.047769 0.085581 0.069591 0.362508 0.094374 0.094375 -0.064863 -0.108112 0.319964 0.107761 -0.082168 -0.089627 0.043302 -0.081550 0.063155 -0.030693 -0.202379 0.000677
polarizability: 4.09245580e+02 4.46199735e+01 2.66149830e+02 -2.88109227e+00 2.47309421e+01 1.53602096e+02
1716.lowfreq: -0.0010 -0.0003 -0.0002 2.0181 5.1706 5.8953 25.6914 31.0885 39.7703
frequency: 25.4404 31.0280 39.7253 48.6869 56.2772 69.2680 89.7390 98.8950 129.0151 134.7647 162.0959 169.8300 178.8567 204.9268 232.8518 249.2130 264.3281 270.5376 287.3105 298.7896 327.8670 344.1132 366.9184 384.0267 398.6721 416.0982 429.0494 439.8268 466.9735 474.1907 524.4646 550.0554 571.8057 575.8876 594.2433 605.0464 616.5484 629.3422 682.2068 691.8784 742.9683 748.0544 755.2272 766.9138 778.2605 791.0176 798.7764 808.2676 844.1676 858.9138 860.8624 889.0753 899.7228 910.9038 942.1987 949.7495 957.0898 965.6963 991.0866 996.3334 1005.9579 1016.8417 1021.8939 1024.7881 1030.4648 1051.6105 1053.6356 1083.3552 1096.1592 1104.8608 1112.6304 1118.5217 1129.0654 1149.9648 1175.6739 1189.2076 1193.7339 1206.8135 1238.6389 1261.4058 1279.0076 1288.9592 1298.1517 1301.6917 1327.6819 1338.7264 1343.5150 1354.7435 1359.9334 1369.8339 1370.4740 1383.3276 1396.4667 1410.5130 1413.7865 1427.0402 1430.2475 1445.0550 1449.4876 1453.1857 1458.7169 1465.5614 1470.9469 1476.4513 1492.9601 1529.0872 1579.1267 1597.6203 1603.2505 2841.9637 2857.0888 2873.9213 2954.7586 2963.2776 3006.1255 3015.2820 3019.7965 3038.0342 3085.0614 3088.4364 3090.4341 3120.2474 3126.6077 3149.1531 3157.7081 3165.3237 3165.6801 3166.3915 3195.1182
redmass: 5.4516 4.3586 4.9936 3.4849 5.6483 5.7522 4.1904 4.8179 4.2250 4.0049 1.4621 3.1613 3.8832 5.0548 3.4412 2.8761 3.4004 4.8846 5.4952 3.6660 2.1344 6.8591 5.3778 5.1813 1.9306 3.0589 6.1232 5.6026 3.3747 4.2653 3.9841 5.8436 3.5140 6.4991 3.3160 3.8775 4.5440 6.5479 7.2798 5.3011 4.6802 4.3358 4.7916 1.8318 2.9938 12.7717 5.0461 3.8719 1.5822 1.5608 3.6560 1.3702 1.3462 2.4858 1.3572 1.2543 1.3257 2.7091 2.7533 4.4193 1.3382 1.4416 2.5530 2.2846 3.3759 2.3178 1.9952 3.7001 2.3849 2.1258 2.1480 2.0418 2.4840 2.7136 2.7696 1.0688 1.2218 1.8300 1.3899 1.3233 1.3806 1.2580 1.1792 1.2699 1.2901 1.3041 1.8935 1.5887 1.9485 1.4972 1.8489 2.4534 2.3536 2.9392 1.0614 4.2741 1.0641 1.0811 1.0824 1.0995 1.1763 2.6002 1.4800 2.1899 5.1205 7.0179 7.5284 6.4383 5.6323 1.0711 1.0696 1.0685 1.0669 1.0667 1.0864 1.0253 1.0901 1.0894 1.0962 1.0939 1.0973 1.0902 1.0940 1.0908 1.1059 1.0943 1.0906 1.1070 1.0999
irintensity: 1.3756 3.4275 1.9886 0.1462 1.5773 0.1435 4.4858 1.5124 2.6114 10.2594 0.1281 0.8100 4.2741 1.9702 1.8990 1.4644 0.9588 9.7329 2.4605 6.8128 11.3946 5.7796 1.3853 0.9210 0.8839 0.5412 7.2919 3.1551 3.8477 3.7602 5.7892 26.3234 5.2934 1.4405 0.6135 4.2136 3.0016 0.7816 4.8279 2.4137 0.3579 10.8410 25.5225 28.6575 21.6743 48.3398 4.1487 18.1534 0.2005 21.5038 10.2010 32.2080 1.9596 18.4095 0.2171 54.0262 8.5348 1.7319 45.6445 10.8487 0.4427 1.5751 3.0189 13.1188 3.1813 17.6630 22.3942 45.7489 17.9729 29.8801 21.3382 5.7918 63.8443 6.3016 19.6111 2.5280 0.4405 8.7816 20.7276 13.1377 8.2853 2.8634 6.9404 6.9659 12.1260 9.6609 69.9130 4.7964 6.5570 1.1262 4.8363 3.0635 10.4441 36.7206 17.5034 2.1312 17.1827 2.9172 0.9305 17.2277 17.0325 37.1191 37.5603 12.8777 33.8989 4.0945 2.1170 37.8772 4.6283 45.8899 60.9052 141.1171 44.9490 63.8279 9.9184 9.2007 40.5480 24.4606 41.3711 46.4044 13.3198 9.5217 8.5676 12.5564 8.5012 0.1839 5.0672 6.1546 9.0312
temp: 298.150 k
press: 1.00000 atm
elementType: 16 8 8 7 7 7 7 6 6 6 6 6 6 6 6 6 6 6 6 6 6 6 6 6 6 1 1 1 1 1 1 1 1 1 1 1 1 1 1 1 1 1 1 1 1
symmnumber: 1
zpe: 926192.3 jmol-1
zpe.correction: 0.352768 hartree
zpe.thermalcorrener: 0.375356 hartree
zpe.thermalcorrenthalpy: 0.376301 hartree
zpe.thermalcorrgfe: 0.299417 hartree
zpe.sumelectzpe: -1463.491301 hartree
zpe.sumelectthermal: -1463.468713 hartree
zpe.sumelectthermalent: -1463.467769 hartree
zpe.sumelectthermalfe: -1463.544652 hartree
dipole: -6.2660 5.7340 5.0589
dipole: 9.8860
quadrupole: -156.7168 -173.3843 -153.2942
quadrupole: 27.3648 6.8935 0.0027
quadrupole: 4.4150 -12.2525 7.8376 27.3648 6.8935 0.0027
hfenergy: -1463.8440692 hartree
pointgroup: C01 [X(C18H20N4O2S1)]
dipole: 1.3210049 -3.28185 1.6162609 debye
polarizability: 419.4394527|-20.5896733|260.6493186|-3.3439807|-10.5223246|148.9087358 unknown
InChI: InChI=1S/C18H20N4O2S/c1-25(23)15-5-3-14(4-6-15)17-16(13-21-9-11-24-12-10-21)22-8-2-7-19-18(22)20-17/h2-8H,9-13H2,1H3
charge 0 multiplicity 1
45 atoms
S  -5.512165 2.021597 -0.257305
O  0.333578 -4.951218 -1.4576
O  -5.565613 3.694965 -0.244099
N  0.359271 -2.473569 0.050175
N  2.632583 0.166159 0.490464
N  1.436821 2.037134 -0.120792
N  3.876537 2.212648 -0.097664
C  0.819067 -1.516855 1.097716
C  1.388002 -2.754479 -0.98517
C  -0.135563 -3.739205 0.655869
C  1.281795 -0.19031 0.565593
C  0.80481 -3.690421 -2.055715
C  -0.690748 -4.662212 -0.442039
C  0.572041 0.980034 0.175955
C  2.688417 1.567936 0.063732
C  -0.886185 1.173398 0.076795
C  3.805603 -0.526957 0.732494
C  -1.404092 2.499226 0.107779
C  -1.780483 0.074922 -0.073986
C  5.012937 0.143095 0.567127
C  5.005461 1.51652 0.149546
C  -2.791363 2.729627 0.022599
C  -3.172422 0.300748 -0.160492
C  -3.648461 1.622283 -0.090436
C  -5.984001 1.545213 1.556163
H  1.630463 -1.968882 1.724734
H  -0.039225 -1.343958 1.775322
H  2.295029 -3.236227 -0.538044
H  1.694876 -1.802071 -1.455106
H  -0.936106 -3.500672 1.382862
H  0.679914 -4.273707 1.205018
H  -0.035883 -3.182348 -2.574753
H  1.573441 -3.980472 -2.790088
H  -0.982379 -5.640784 -0.02695
H  -1.571577 -4.183177 -0.921801
H  3.731223 -1.571775 1.042774
H  -0.697422 3.330775 0.188042
H  -1.377594 -0.940865 -0.182065
H  5.954674 -0.37815 0.750897
H  5.947267 2.057742 0.013362
H  -3.230489 3.73589 0.03132
H  -3.85803 -0.543401 -0.302409
H  -5.36087 2.176512 2.20546
H  -5.792524 0.4727 1.711987
H  -7.051012 1.790392 1.660724
