program: Gaussian 09
title: 000017091
version: EM64L-G09RevD.01
frameworkgroup: C1[X(C11H11N)]
method: RPBEPBE
basis: SDD
operation: Freq
keyword: #pfreq=noraman
keyword: PBEPBE/SDD
title: #p freq=noraman PBEPBE/SDD
converged: NO NO NO YES
title: Mulliken charges:
elementType: N C C C C C C C C C C C H H H H H H H H H H H
charge: -0.022220 0.230575 0.282373 0.314371 -0.049163 -0.379154 -0.840609 -0.539871 -0.307104 -0.840337 -0.256198 -0.228588 0.240414 0.240814 0.252383 0.240848 0.243246 0.231848 0.235055 0.235049 0.260285 0.225669 0.230315
chargesum: 0.00000
title: Mulliken charges with hydrogens summed into heavy atoms:
elementType: N C C C C C C C C C C C
charge: -0.022220 0.230575 0.282373 0.314371 -0.049163 -0.138741 -0.106564 -0.296624 -0.046819 -0.138385 -0.030529 0.001727
polarizability: 1.85443329e+02 6.99064078e+00 1.32254031e+02 -9.68100982e-05 5.47861799e-03 5.86677012e+01
1716.lowfreq: -0.0007 0.0004 0.0004 10.0192 13.5701 18.6930 105.1658 124.2998 143.4910
frequency: 105.1315 124.2993 143.4526 172.5528 226.1833 271.3690 302.5523 323.6642 428.5491 437.8117 465.8566 503.8054 508.8961 558.0197 561.0682 651.7399 666.7854 730.4388 770.5597 796.1707 833.9304 876.1681 880.5816 921.5340 967.0314 995.5760 998.1735 1020.4391 1026.2535 1052.3177 1065.9479 1090.4497 1151.2266 1177.1896 1213.8081 1256.5669 1279.4185 1326.2436 1377.5973 1384.7287 1399.4186 1404.6923 1430.1403 1454.7370 1461.0324 1466.4291 1488.9330 1489.5340 1506.4591 1559.8774 1583.1471 1620.6788 2974.1441 2978.9667 3049.0844 3052.2842 3079.6427 3099.7193 3110.3968 3125.5480 3139.4303 3154.5329 3169.3729
redmass: 3.2471 1.9725 1.2532 1.0924 3.5951 3.3595 3.7405 2.6044 3.0760 5.5691 4.0745 3.1917 5.0576 3.4150 5.9062 3.1112 5.5177 5.2127 1.3138 2.9240 5.0505 2.8438 1.6870 1.3491 1.3668 1.3213 1.5073 2.2887 1.4659 1.6392 2.2635 2.1956 1.4847 1.3478 2.9843 2.1752 1.6840 5.6567 2.0439 3.0726 1.2598 1.2316 4.2515 2.2325 1.3131 1.0463 1.0993 1.0454 2.7832 6.9717 5.9073 6.3761 1.0374 1.0399 1.0968 1.0979 1.0983 1.0909 1.0955 1.0850 1.0894 1.0958 1.0993
irintensity: 2.3807 0.4294 0.7914 0.6145 1.2532 1.6196 0.0209 0.3337 8.1145 0.1413 3.0163 0.0574 0.4442 1.6449 2.5423 1.4696 0.6254 3.6539 91.8185 0.7057 1.5763 4.2154 0.1619 8.0359 3.1035 0.2611 8.0036 9.8450 8.7242 1.3147 0.6689 4.5775 4.7375 1.8762 2.2825 4.7375 4.7422 2.8183 9.7481 16.1649 19.0254 10.4897 1.5129 3.2435 6.5197 26.3199 11.2295 0.1227 36.3183 5.0955 14.5291 0.7757 34.0556 20.2888 18.6946 15.6546 16.1644 36.9552 21.1750 0.7119 11.3571 27.6255 22.4330
temp: 298.150 k
press: 1.00000 atm
elementType: 7 6 6 6 6 6 6 6 6 6 6 6 1 1 1 1 1 1 1 1 1 1 1
symmnumber: 1
zpe: 493114.4 jmol-1
zpe.correction: 0.187817 hartree
zpe.thermalcorrener: 0.197927 hartree
zpe.thermalcorrenthalpy: 0.198871 hartree
zpe.thermalcorrgfe: 0.152721 hartree
zpe.sumelectzpe: -479.688799 hartree
zpe.sumelectthermal: -479.678690 hartree
zpe.sumelectthermalent: -479.677746 hartree
zpe.sumelectthermalfe: -479.723896 hartree
dipole: -1.2023 2.9108 0.0005
dipole: 3.1494
quadrupole: -57.9265 -70.2998 -74.7694
quadrupole: 0.5251 -0.0001 0.0006
quadrupole: 9.7387 -2.6345 -7.1042 0.5251 -0.0001 0.0006
hfenergy: -479.8766168 hartree
pointgroup: C01 [X(C11H11N1)]
dipole: 0.4401791 -1.1582288 0.000192 debye
dipolederiv: -0.397415 0.0843385 -0.0000082 0.0747809 -0.3351181 0.0000153 -0.000008 0.0000031 -0.2434714 0.0384429 -0.0004813 0.0000083 -0.183953 0.4215716 -0.0000733 0.0000565 -0.0001834 -0.0516608 -0.0270038 0.0733282 -0.0000195 0.1610635 -0.2391041 0.0000037 -0.0000362 0.000021 0.0428698 0.3145228 -0.0941021 0.000026 -0.1919205 -0.3887165 0.0000276 0.0000184 0.0000134 0.0091675 0.2209089 0.1118793 0. -0.0404582 -0.0027715 0.0000093 0.0000023 0.0000101 0.0461509 -0.0852419 0.0034449 0.0000069 0.0074192 0.0703384 -0.0000498 0.0000182 -0.0000253 -0.1713266 0.0363783 -0.0012504 0.0000014 0.0751394 -0.1911885 0.0000502 -0.0000823 0.000231 0.0524035 0.0959726 -0.0496427 0.00001 0.1885472 0.4231088 -0.0000225 0.0000128 -0.0000051 -0.0858762 -0.0256522 -0.0303924 0.0000005 -0.0711448 0.1179381 -0.0000157 -0.0000024 -0.0000133 -0.1465967 -0.1362713 0.0388258 0.0000035 0.144969 0.0856247 0.0000051 0.0000177 0.0000249 0.0651695 -0.0416442 0.0817428 -0.0000211 0.1107056 0.1213649 -0.0000156 -0.0000109 -0.0000349 -0.1556324 0.0733284 -0.1077933 -0.0000008 -0.1337872 -0.0635365 -0.0000126 0.0000023 0.0000002 -0.1645703 0.0817742 0.0644085 -0.0000045 0.0129281 -0.1013036 0.0000296 -0.0000112 0.0000236 0.1475125 0.0716895 -0.0496216 -0.082923 -0.0022569 0.0049862 -0.0634571 -0.0501292 -0.0975782 -0.0316397 -0.1374489 0.0873258 0.0001764 -0.0021163 0.1000808 0.0000236 0.0001773 -0.0000738 0.097696 0.0719086 -0.04933 0.0827264 -0.0020798 0.0049885 0.0634528 0.0499885 0.0975765 -0.0319556 -0.0747738 -0.1244435 -0.0000005 -0.1098996 -0.0161726 0.0000016 -0.0000138 -0.0000031 0.1174474 0.0334691 -0.0422986 -0.0000064 -0.1762703 -0.0935622 -0.0000041 -0.000009 -0.0000079 0.1085277 -0.0132337 0.0190476 -0.0264755 0.0646803 0.0394178 0.1092654 -0.0883055 0.0915116 -0.0404616 -0.013235 0.0190547 0.0264855 0.0647104 0.0393959 -0.10927 0.088296 -0.0915225 -0.0404438 0.0824803 0.013543 0.0000008 0.0730199 -0.0509983 0.0000123 -0.0000021 0.0000075 0.1573066 -0.0379852 -0.1060461 0.0000127 -0.1196133 -0.0216325 0.000018 0.0000144 0.0000179 0.1586772 -0.1309707 0.0584629 0.0000012 0.0555365 0.0752888 0.000006 0.0000061 0.0000066 0.1607065 unknown
polarizability: 185.7984039|5.4641377|131.8989561|-0.0000594|-0.0054792|58.6677012 unknown
InChI: InChI=1S/C11H11N/c1-8-7-12-11-6-4-3-5-10(11)9(8)2/h3-7H,1-2H3
charge 0 multiplicity 1
23 atoms
N  0.263033 1.931003 -0.000048
C  1.102964 -0.835114 0.000057
C  -0.301966 -0.492899 0.000057
C  2.044342 0.214469 0.000056
C  -0.677491 0.90856 -0.000006
C  -1.347996 -1.474823 0.000176
C  1.523323 -2.292733 0.000169
C  1.556697 1.56724 0.0000
C  -2.062075 1.272877 -0.000009
C  3.545601 -0.014322 0.000122
C  -2.692441 -1.09348 0.00018
C  -3.054806 0.290822 0.000079
H  -1.089677 -2.539273 0.000283
H  1.12897 -2.822258 -0.888042
H  2.618119 -2.403973 -0.000673
H  1.130418 -2.821657 0.889399
H  2.285449 2.389531 0.00001
H  4.084035 0.949302 0.000144
H  3.876864 -0.581317 0.890557
H  3.87694 -0.581312 -0.89029
H  -2.300298 2.341142 -0.000065
H  -3.477365 -1.858344 0.000264
H  -4.112739 0.576157 0.000082
