program: Gaussian 09
title: 000201180
version: EM64L-G09RevD.01
frameworkgroup: C1[X(C17H15ClN2)]
method: RPBEPBE
basis: SDD
operation: Freq
keyword: #p
keyword: freq=noraman
keyword: PBEPBE/SDD
title: #p freq=noraman PBEPBE/SDD
converged: NO YES NO NO
title: Mulliken charges:
elementType: Cl N N C C C C C C C C C C C C C C C C C H H H H H H H H H H H H H H H
charge: -0.058085 -0.370618 -0.479045 -0.309160 0.179231 0.148752 -0.471795 -0.437378 0.165133 0.201071 0.483361 -0.422369 -0.371083 -0.483712 -0.342520 -0.254605 -0.223192 -0.205703 -0.215679 -0.116117 0.219915 0.207622 0.227479 0.194227 0.217717 0.269917 0.312646 0.231094 0.230378 0.246737 0.276740 0.218166 0.219585 0.255848 0.255440
chargesum: 0.00000
title: Mulliken charges with hydrogens summed into heavy atoms:
elementType: Cl N N C C C C C C C C C C C C C C C C C
charge: -0.058085 -0.100701 -0.166400 -0.089245 0.179231 0.148752 -0.036694 -0.025434 0.165133 0.201071 0.483361 -0.191274 -0.140705 -0.236976 -0.065780 -0.036438 -0.003607 0.050146 0.039762 -0.116117
polarizability: 2.79770565e+02 4.23454207e+00 1.95995852e+02 -1.91863373e+01 -6.56127981e+00 1.44730278e+02
1716.lowfreq: -2.7232 0.0015 0.0019 0.0026 4.9474 10.1057 26.8130 33.2045 47.5654
frequency: 26.7557 33.1901 47.5530 90.8245 128.8976 135.9336 178.1644 203.7908 232.5066 263.4600 275.6073 314.8954 325.5431 333.1771 403.8864 409.8404 425.6569 435.8905 476.5267 502.9026 513.2596 529.9443 559.4674 578.0932 591.7431 623.2910 628.5944 651.0051 685.5489 717.4283 730.8622 748.8925 760.5496 767.7597 820.6285 831.3687 837.1211 840.3731 850.5830 884.7210 913.4954 928.4722 952.8680 968.3385 972.8898 977.3424 1001.2132 1012.0594 1015.9989 1055.6757 1068.6600 1101.4734 1109.7510 1137.7339 1152.0489 1168.6835 1174.9020 1188.9394 1205.1808 1217.8683 1228.9078 1242.5798 1261.3439 1277.8144 1305.0946 1309.5013 1311.6526 1353.3258 1372.8103 1382.8919 1396.9900 1406.2166 1436.8747 1444.4716 1458.1473 1469.3504 1473.6133 1475.3111 1481.8995 1580.2215 1588.1518 1596.4629 1599.0841 1633.5556 2806.3493 2876.9065 2971.5930 3022.5324 3047.2906 3121.5514 3121.8641 3129.5333 3143.3922 3152.2542 3161.3496 3169.8998 3173.5236 3468.7912 3598.3043
redmass: 5.4249 5.1058 4.4878 5.1104 5.7853 4.3981 3.4481 5.3835 6.4411 3.5594 4.4162 5.2469 4.4774 2.8198 5.7538 2.9250 3.2798 5.0416 2.8152 3.5001 1.2455 3.2723 3.4358 3.5030 3.5005 6.5224 4.2606 2.9416 5.4946 3.5833 2.5519 1.3875 3.6152 3.7797 3.2336 1.3848 3.0654 1.6690 1.5478 3.8254 2.2114 1.3863 1.3812 1.3013 1.3869 3.6027 4.1010 2.0158 2.5230 1.9154 2.6817 1.3812 1.7899 3.5486 2.3153 1.2089 1.1207 1.1942 2.2139 1.3555 1.3979 1.8396 1.3362 1.5143 1.9470 2.0432 1.3872 1.6873 1.7044 6.3487 2.3709 3.9126 1.8587 2.0778 1.1098 1.6026 2.4724 2.0180 3.0148 6.5967 7.3816 6.5234 6.8101 7.0923 1.0793 1.0713 1.0599 1.1003 1.0908 1.0900 1.0846 1.0890 1.0952 1.0887 1.1001 1.0950 1.0968 1.0755 1.0803
irintensity: 0.2801 0.0168 0.7492 1.5634 0.3299 0.5022 1.8617 0.7596 0.6808 1.8359 2.5434 0.7029 0.0519 2.0317 10.7299 0.9770 5.8240 4.6457 18.9337 46.1469 65.3379 14.9807 30.9228 3.1701 7.6103 1.6619 32.9933 22.8351 9.3445 9.8472 2.0158 114.0181 7.4881 9.1855 31.1643 16.0170 4.2070 43.7251 0.3904 2.4793 2.7818 2.8915 1.0151 0.0042 0.2078 3.9110 49.3896 7.8917 2.8425 0.5396 36.2385 11.6970 3.6519 40.6084 10.9456 2.7635 4.1256 2.3076 0.0856 10.2746 5.7405 3.8745 32.1756 15.6363 31.0157 16.2427 3.3409 32.5515 21.7667 1.6874 8.2034 26.6856 6.0304 16.0261 9.3841 24.0879 78.1291 15.8347 4.0430 0.7642 1.7954 7.2320 7.2864 1.6211 73.3378 121.1390 43.0934 36.1715 55.9240 9.8546 1.2740 3.4121 36.8295 0.7797 36.9941 5.5393 1.2159 0.2726 48.3383
temp: 298.150 k
press: 1.00000 atm
elementType: 17 7 7 6 6 6 6 6 6 6 6 6 6 6 6 6 6 6 6 6 1 1 1 1 1 1 1 1 1 1 1 1 1 1 1
symmnumber: 1
zpe: 728353.8 jmol-1
zpe.correction: 0.277415 hartree
zpe.thermalcorrener: 0.293484 hartree
zpe.thermalcorrenthalpy: 0.294428 hartree
zpe.thermalcorrgfe: 0.232536 hartree
zpe.sumelectzpe: -1224.984175 hartree
zpe.sumelectthermal: -1224.968107 hartree
zpe.sumelectthermalent: -1224.967162 hartree
zpe.sumelectthermalfe: -1225.029054 hartree
dipole: 0.0064 1.8181 1.7337
dipole: 2.5122
quadrupole: -136.2449 -113.7723 -118.7483
quadrupole: -0.3334 -6.5577 -2.5022
quadrupole: -13.3231 9.1496 4.1735 -0.3334 -6.5577 -2.5022
hfenergy: -1225.2615902 hartree
pointgroup: C01 [X(C17H15Cl1N2)]
dipole: -0.0785319 0.6247388 0.761863 debye
polarizability: 277.8140508|15.5459898|199.2855408|-16.4418964|-2.1048425|143.3971044 unknown
InChI: InChI=1S/C17H15ClN2/c18-12-7-5-11(6-8-12)16-17-14(9-10-19-16)13-3-1-2-4-15(13)20-17/h1-8,16,19-20H,9-10H2
charge 0 multiplicity 1
35 atoms
Cl -5.66744 -2.019878 -0.896344
N  -0.704783 2.560331 0.22505
N  0.814188 -0.832539 0.699356
C  -0.728369 1.226883 0.879754
C  0.563436 0.533949 0.49971
C  1.683271 1.142605 -0.060422
C  1.710017 2.617605 -0.377776
C  0.562648 3.315846 0.393897
C  2.683606 0.107293 -0.236198
C  2.108635 -1.125588 0.248567
C  -1.967079 0.43715 0.447017
C  4.00729 0.091541 -0.749599
C  2.813961 -2.347435 0.223287
C  -2.778777 -0.217566 1.403449
C  -2.300803 0.334709 -0.927372
C  4.716206 -1.126074 -0.775324
C  4.125967 -2.332531 -0.295481
C  -3.908498 -0.972406 1.005707
C  -3.423673 -0.410147 -1.343626
C  -4.209311 -1.055074 -0.365656
H  -0.760781 1.30922 1.999344
H  2.677504 3.074107 -0.089764
H  1.579335 2.786482 -1.465121
H  0.858499 3.405415 1.468268
H  0.404331 4.336676 0.00233
H  -1.537728 3.11052 0.466581
H  0.126542 -1.509914 1.023602
H  4.471294 1.011463 -1.12343
H  2.366426 -3.277543 0.59146
H  -2.541351 -0.131691 2.471236
H  -1.674429 0.85445 -1.659476
H  5.73811 -1.151936 -1.170103
H  4.702224 -3.26394 -0.329383
H  -4.539289 -1.474979 1.744309
H  -3.684379 -0.491104 -2.402851
