program: Gaussian 09
title: 000201256
version: EM64L-G09RevD.01
frameworkgroup: C1[X(C18H17N3O3)]
method: RPBEPBE
basis: SDD
operation: Freq
keyword: #p
keyword: freq=noraman
keyword: PBEPBE/SDD
title: #p freq=noraman PBEPBE/SDD
converged: YES YES NO NO
title: Mulliken charges:
elementType: O O O N N N C C C C C C C C C C C C C C C C C C H H H H H H H H H H H H H H H H H
charge: -0.282126 -0.304605 -0.509456 -0.128994 -0.257280 -0.429256 0.347592 0.032608 0.055473 0.450113 -0.652690 -0.804796 -0.360996 -0.384788 0.127573 0.089839 -0.215518 -0.211473 -0.251377 0.241784 -0.297058 -0.388893 -0.255925 -0.199776 0.268168 0.239488 0.254557 0.229009 0.230799 0.341214 0.442471 0.282935 0.264544 0.228110 0.227891 0.230060 0.281818 0.219951 0.233425 0.231797 0.383787
chargesum: 0.00000
title: Mulliken charges with hydrogens summed into heavy atoms:
elementType: O O O N N N C C C C C C C C C C C C C C C C C C
charge: -0.282126 -0.304605 -0.125669 -0.128994 -0.257280 0.013215 0.347592 0.032608 0.055473 0.450113 0.109524 -0.003774 -0.078061 -0.120244 0.127573 0.089839 0.012593 0.016418 -0.021317 0.241784 -0.015240 -0.168943 -0.022500 0.032020
polarizability: 3.94043735e+02 6.23256126e-01 2.47605154e+02 -4.19668943e+00 1.59682421e+01 1.15797539e+02
1716.lowfreq: -7.7723 -0.0009 -0.0005 -0.0005 0.5289 3.2011 16.6803 28.1955 49.4970
frequency: 16.5404 28.1722 49.4948 52.0239 62.4060 86.8762 106.8598 124.5174 145.4621 167.3695 175.2670 193.0696 202.0338 227.5795 247.3930 259.2741 272.4380 295.1537 303.1282 324.3232 346.6548 374.0954 388.5660 408.2740 409.2281 432.9670 446.0541 500.3917 506.1524 527.6716 538.3163 567.8465 576.5431 613.3172 616.9625 626.9040 648.2673 669.1158 693.3400 707.8357 723.2139 751.4627 762.8469 766.2639 791.7509 814.5573 843.0231 856.1257 878.7781 898.0899 911.1203 918.0734 957.0974 971.8623 986.0057 990.9442 999.0374 1011.2752 1034.3603 1036.5131 1052.5693 1059.2919 1071.5744 1078.0688 1094.8153 1105.3182 1130.0303 1142.7258 1170.4746 1172.2346 1179.3587 1186.8794 1199.1715 1225.1992 1267.6660 1289.5661 1300.0354 1320.1282 1341.2205 1363.5949 1385.3746 1390.9252 1400.2761 1432.4165 1435.0445 1445.0096 1457.7710 1473.4819 1479.6681 1484.7757 1486.9351 1497.7258 1554.5322 1574.1833 1589.8615 1603.3224 1608.9772 1617.5509 1626.6225 1649.0422 2964.8032 2970.4068 3045.6089 3086.8104 3097.8232 3117.3396 3129.1270 3130.2293 3139.6693 3141.7883 3153.7976 3155.4491 3166.2654 3171.6198 3188.6560 3260.0933 3615.8605
redmass: 5.4056 5.6185 7.1776 4.3230 4.8882 4.6973 4.9901 4.4779 2.6310 4.4535 1.2923 5.8631 5.0859 1.3248 3.6291 3.8076 4.6598 3.5396 6.6916 1.1135 3.7960 5.8057 5.3722 4.9544 3.2743 4.8907 3.8315 3.4102 5.3914 3.6819 7.0296 5.3238 5.7118 6.3374 6.8585 5.4192 5.8166 4.3415 2.7578 3.7769 7.4783 2.7487 1.7317 1.6341 5.3403 6.2782 1.2574 1.4395 6.4246 1.1462 1.8688 1.9537 1.3521 1.3642 4.2731 1.4387 1.3317 3.5538 2.1219 2.1494 1.4574 2.6276 2.5303 1.9528 2.0078 1.8060 1.9233 1.2949 1.0791 1.0519 2.4306 1.3195 3.0000 3.0341 3.7047 1.6196 3.1354 1.4859 3.6322 4.0126 8.5528 7.8367 1.3222 1.2027 2.4197 2.1888 1.0917 1.0924 2.4896 1.6515 1.3289 1.0690 4.8510 2.8030 6.3675 7.4134 5.7254 6.5800 4.5505 5.4479 1.0386 1.0442 1.0958 1.0892 1.0989 1.0885 1.0861 1.1001 1.0893 1.0885 1.0941 1.0931 1.0995 1.1001 1.0962 1.0800 1.0667
irintensity: 1.9153 6.2084 0.7869 0.8209 5.2471 0.3779 2.0666 1.2543 4.9247 0.9988 0.9408 3.0732 10.7887 1.5148 1.4774 2.0486 2.9456 21.1626 1.5265 139.8922 8.3504 4.5904 6.2133 4.2986 3.3484 12.3731 4.5500 10.6204 12.9125 13.7928 14.1065 29.5318 5.5995 3.1010 42.7480 17.9787 8.8264 15.1815 15.0905 42.2932 14.5212 33.7749 61.6273 60.1276 14.5163 10.1787 0.9919 1.1088 11.1649 98.9375 6.5702 6.3012 1.9766 0.8434 0.5093 0.5650 0.8452 23.8200 3.5777 3.6515 1.4156 70.7375 29.3625 5.6198 6.8135 40.4284 23.3176 26.5787 4.7076 0.3012 37.7187 4.5046 21.7450 20.7004 29.9426 27.1197 179.0964 66.7261 123.9296 185.9365 1.7713 12.2003 56.9248 6.0202 32.7891 18.5966 21.6605 61.3984 54.9782 100.8776 58.4239 19.0366 391.1584 264.2551 7.2728 188.1021 16.5634 153.0831 13.8246 32.4920 51.7737 92.6807 24.1779 15.6258 18.5300 8.4855 4.2766 7.3366 12.9637 9.9206 26.7884 5.6813 22.7792 29.7199 1.7541 158.6656 55.2607
temp: 298.150 k
press: 1.00000 atm
elementType: 8 8 8 7 7 7 6 6 6 6 6 6 6 6 6 6 6 6 6 6 6 6 6 6 1 1 1 1 1 1 1 1 1 1 1 1 1 1 1 1 1
symmnumber: 1
zpe: 833313.0 jmol-1
zpe.correction: 0.317392 hartree
zpe.thermalcorrener: 0.338778 hartree
zpe.thermalcorrenthalpy: 0.339722 hartree
zpe.thermalcorrgfe: 0.265860 hartree
zpe.sumelectzpe: -1084.341161 hartree
zpe.sumelectthermal: -1084.319775 hartree
zpe.sumelectthermalent: -1084.318831 hartree
zpe.sumelectthermalfe: -1084.392694 hartree
dipole: -0.8041 -0.5173 -1.1238
dipole: 1.4755
quadrupole: -107.3228 -124.4543 -142.4078
quadrupole: -20.8638 -1.0263 0.6068
quadrupole: 17.4055 0.2740 -17.6795 -20.8638 -1.0263 0.6068
hfenergy: -1084.6585532 hartree
pointgroup: C01 [X(C18H17N3O3)]
dipole: 0.336028 0.4716588 0.0402813 debye
polarizability: 392.3671286|-17.4035142|146.0007626|13.1306487|56.21225|219.0785371 unknown
InChI: InChI=1S/C18H17N3O3/c1-12-16(19-17(23)14-10-6-7-11-15(14)22)18(24)21(20(12)2)13-8-4-3-5-9-13/h3-11,19,22H,1-2H3
charge 0 multiplicity 1
41 atoms
O  0.773608 0.631706 1.606024
O  -2.490531 -1.268442 -1.867521
O  -2.740648 0.879299 1.795834
N  2.116211 -0.872027 -1.327552
N  2.281741 -0.203661 -0.07129
N  -1.311225 -0.188057 -0.153884
C  0.720318 -0.903196 -1.614095
C  0.031557 -0.363851 -0.529562
C  1.004585 0.105526 0.471775
C  3.506076 -0.300576 0.656736
C  3.070289 -0.463637 -2.389576
C  0.284787 -1.43744 -2.947729
C  3.815539 0.699878 1.613411
C  4.392591 -1.388615 0.446097
C  -2.474141 -0.609205 -0.77374
C  -3.7722 -0.254119 -0.084753
C  5.016603 0.607058 2.346937
C  5.598673 -1.456406 1.175408
C  5.918525 -0.460625 2.12731
C  -3.913746 0.451262 1.145578
C  -4.962641 -0.678086 -0.732221
C  -5.186561 0.718044 1.699524
C  -6.237174 -0.418695 -0.19347
C  -6.349119 0.282923 1.030129
H  4.101571 -0.582245 -2.024627
H  2.913987 0.58915 -2.69872
H  2.926033 -1.125739 -3.256256
H  0.789222 -2.395454 -3.172506
H  0.519434 -0.729094 -3.76673
H  -0.804601 -1.590946 -2.926883
H  -1.419438 0.307618 0.752899
H  3.110356 1.516189 1.784979
H  4.11607 -2.184224 -0.253455
H  5.250281 1.377509 3.089888
H  6.279971 -2.298553 1.010542
H  6.85295 -0.520284 2.695488
H  -4.83707 -1.221684 -1.674313
H  -5.266918 1.263806 2.648558
H  -7.135279 -0.759442 -0.717969
H  -7.333139 0.491954 1.463412
H  -2.91204 1.322284 2.660523
