program: Gaussian 09
title: 000201188
version: EM64L-G09RevD.01
frameworkgroup: C1[X(C20H26N2O2)]
method: RPBEPBE
basis: SDD
operation: Freq
keyword: #p
keyword: freq=noraman
keyword: PBEPBE/SDD
title: #p freq=noraman PBEPBE/SDD
converged: YES YES NO NO
title: Mulliken charges:
elementType: O O N N C C C C C C C C C C C C C C C C C C C C H H H H H H H H H H H H H H H H H H H H H H H H H H
charge: -0.451708 -0.423081 -0.062736 -0.298522 0.439053 -0.279438 -0.587556 0.195673 -0.517163 0.144630 -0.452766 -0.442164 -0.384886 0.083555 -0.451392 -0.543461 0.167751 0.173635 -0.379258 -0.739646 -0.320973 -0.435525 -0.251752 -0.251044 0.236421 0.219122 0.252223 0.228876 0.195548 0.245859 0.194376 0.199696 0.219130 0.201486 0.217313 0.226691 0.224661 0.222476 0.226809 0.224736 0.230678 0.220914 0.221857 0.222562 0.350256 0.255298 0.235119 0.357444 0.219637 0.219582
chargesum: 0.00000
title: Mulliken charges with hydrogens summed into heavy atoms:
elementType: O O N N C C C C C C C C C C C C C C C C C C C C
charge: -0.101451 -0.065637 -0.062736 -0.298522 0.439053 -0.043016 -0.116210 0.195673 -0.092739 0.144630 -0.012531 -0.023338 0.033913 0.083555 -0.000040 -0.094176 0.167751 0.173635 0.076156 -0.074313 -0.065675 -0.200407 -0.032114 -0.031462
polarizability: 2.88535272e+02 -5.41808835e+00 2.38068936e+02 1.36642012e+01 1.00182412e+01 1.61557485e+02
1716.lowfreq: -9.7497 -4.9975 -0.0007 0.0004 0.0008 12.0218 44.2410 68.9959 74.8802
frequency: 44.1869 68.9214 74.8531 89.4528 101.6979 118.1931 145.0092 169.4404 179.4052 193.9666 200.4744 229.6682 243.3103 269.6369 276.2620 293.5048 308.9594 311.4385 321.5728 329.2844 352.0298 364.5724 369.4375 374.8632 432.4825 442.5241 445.1385 465.4563 483.8938 501.7349 523.7135 549.3158 557.5273 582.9801 589.3958 606.5518 637.6601 651.2819 694.4843 726.0474 746.7764 751.6229 754.9980 769.7814 777.5051 785.4893 829.2555 852.4516 861.8952 875.2896 887.5897 904.7374 916.8147 924.0729 930.9786 947.1069 960.5337 969.6600 973.6650 986.3013 1001.2830 1016.9617 1017.9446 1028.6094 1035.2394 1052.8727 1057.7531 1069.3092 1090.1276 1110.0368 1119.3606 1130.0613 1137.7563 1146.1927 1160.9361 1163.5546 1181.4290 1189.2727 1200.7296 1206.5959 1221.2856 1247.3402 1258.5098 1267.5555 1271.3308 1279.3153 1291.8214 1295.9106 1307.2499 1311.7212 1323.7683 1327.2087 1332.5066 1338.9464 1342.9859 1351.2239 1359.5330 1368.9672 1370.5719 1376.0888 1395.1317 1403.8414 1409.6129 1446.6122 1451.9147 1454.3704 1459.9936 1466.2943 1467.5710 1468.3697 1474.7679 1476.3273 1480.0406 1485.8686 1494.0422 1574.5182 1595.9542 1622.2159 2877.2032 2930.5983 2951.8661 2960.1423 2969.9916 2976.9451 2986.4368 2997.1677 2998.1700 3005.8282 3006.1744 3018.8242 3028.1162 3029.7826 3053.9492 3060.0936 3067.7377 3071.9744 3072.3556 3096.8798 3122.9307 3135.6266 3153.8710 3170.8269 3529.6714 3563.1431
redmass: 4.6405 3.9747 2.6981 3.9290 4.0630 3.0610 3.1622 1.9090 4.3010 3.2148 2.8417 1.8935 2.7697 3.3318 2.2808 2.7115 2.8104 1.9267 2.0183 3.8522 2.6369 2.2290 2.3037 2.5037 3.0197 4.0412 3.5896 2.8427 1.4302 2.5690 4.2579 3.5598 3.4538 3.9310 5.2301 3.2508 4.9919 5.3365 3.2048 3.1190 2.0695 1.9025 3.8940 3.5094 1.3709 2.1089 2.9503 1.4575 2.0685 2.2163 3.1036 2.4402 2.5281 2.4034 1.4072 2.0106 2.8306 1.3106 2.5046 2.9384 2.2589 2.2021 1.9621 2.0824 2.2078 2.3701 2.4223 1.9261 2.4971 2.1968 2.3376 1.5660 1.9126 2.0241 1.8368 1.3048 1.3352 1.4783 1.8909 1.5421 1.7654 2.0546 1.4362 1.4505 1.3431 1.4723 1.4157 1.3406 1.6148 2.2761 1.3941 1.4154 1.4444 1.5924 1.4242 1.4570 1.8648 1.4144 1.5593 1.2587 1.2179 3.7156 6.3177 1.0898 3.2865 1.1232 1.0857 1.1020 1.1549 1.0941 2.8763 1.0855 1.0484 1.0744 1.0592 6.6198 8.3954 7.5895 1.0693 1.0826 1.0640 1.0611 1.0642 1.0367 1.0662 1.0647 1.0639 1.0917 1.0643 1.0891 1.0932 1.0963 1.1051 1.1021 1.0984 1.0993 1.0963 1.1007 1.0851 1.0904 1.0961 1.0974 1.0648 1.0660
irintensity: 0.8074 2.2207 0.3219 0.7768 2.3772 0.3609 1.1252 0.5579 2.2289 2.5518 3.9534 0.9292 0.5979 1.6783 4.7280 2.9375 3.5600 47.3124 21.3180 8.0288 9.6419 31.5091 2.2810 7.5446 6.4497 3.6599 7.2014 3.7609 137.8369 58.0056 2.4517 3.3898 4.1715 0.8816 3.5784 3.8779 1.8446 10.7580 11.5578 2.3493 49.1284 45.7348 1.8694 5.1214 6.1091 7.6542 23.3449 2.2014 9.9594 21.1016 3.4864 6.2664 4.8448 0.5205 2.1118 14.1769 27.8827 1.0898 13.4602 44.1473 15.1898 24.4715 15.2008 37.1196 44.3691 10.2488 10.3678 9.7553 27.3925 10.3669 9.0017 36.7626 10.4751 10.9524 7.5342 1.1263 13.5873 7.3283 11.1250 6.5021 28.9928 1.7242 11.8088 19.5780 4.9952 11.1216 0.9590 16.9253 3.6298 68.6069 1.7032 78.2717 21.2961 8.2930 8.1954 1.7173 70.2431 2.7189 10.7624 11.3686 17.5374 31.1762 9.8976 4.8151 33.3511 16.1960 9.1112 10.0314 2.5753 5.1701 13.3314 0.9420 8.6327 12.0615 6.8596 0.4928 2.7321 1.7372 52.9457 28.4392 47.4278 42.2133 23.9447 30.8415 43.1634 23.3249 13.1228 46.8092 43.2721 52.5275 65.2388 8.0993 39.6430 45.7606 42.3489 40.0089 24.3480 17.2157 0.9807 15.7859 38.6227 15.7114 14.4726 9.4741
temp: 298.150 k
press: 1.00000 atm
elementType: 8 8 7 7 6 6 6 6 6 6 6 6 6 6 6 6 6 6 6 6 6 6 6 6 1 1 1 1 1 1 1 1 1 1 1 1 1 1 1 1 1 1 1 1 1 1 1 1 1 1
symmnumber: 1
zpe: 1115819.6 jmol-1
zpe.correction: 0.424993 hartree
zpe.thermalcorrener: 0.445921 hartree
zpe.thermalcorrenthalpy: 0.446865 hartree
zpe.thermalcorrgfe: 0.377814 hartree
zpe.sumelectzpe: -1035.880655 hartree
zpe.sumelectthermal: -1035.859728 hartree
zpe.sumelectthermalent: -1035.858784 hartree
zpe.sumelectthermalfe: -1035.927835 hartree
dipole: -2.0257 -2.0984 1.5125
dipole: 3.2855
quadrupole: -143.2053 -147.5103 -142.3098
quadrupole: -1.7080 -1.6072 6.6026
quadrupole: 1.1365 -3.1685 2.0320 -1.7080 -1.6072 6.6026
hfenergy: -1036.3056487 hartree
pointgroup: C01 [X(C20H26N2O2)]
dipole: 0.80146 0.8219344 0.5940883 debye
polarizability: 288.3317463|-5.4239826|238.1838844|-14.5952607|-9.5397657|161.6460627 unknown
InChI: InChI=1S/C20H26N2O2/c1-2-19-9-5-10-21-11-8-15-14-6-3-4-7-16(14)22(17(15)18(19)21)20(24,12-19)13-23/h3-4,6-7,18,23-24H,2,5,8-13H2,1H3
charge 0 multiplicity 1
50 atoms
O  -0.137602 -2.561709 1.21361
O  0.136874 -4.26338 -0.923891
N  1.747276 2.16392 -0.398333
N  -0.687963 -0.655982 -0.188574
C  2.202535 -0.337716 -0.050103
C  1.380341 0.763311 -0.789454
C  1.557476 -1.702752 -0.438235
C  -0.099032 0.568363 -0.567827
C  2.156201 -0.060269 1.4801
C  0.049897 -1.924975 -0.115594
C  3.66447 -0.304664 -0.604229
C  2.619792 1.377978 1.806721
C  1.726732 2.396401 1.072054
C  -1.04204 1.586929 -0.55621
C  0.878441 3.125616 -1.138979
C  -0.655221 3.026379 -0.805137
C  -2.05507 -0.412282 0.093695
C  -2.298875 0.991775 -0.142146
C  -0.55831 -2.988317 -1.071101
C  4.696819 -1.181133 0.136682
C  -3.0693 -1.271365 0.571388
C  -3.599439 1.516582 0.075756
C  -4.351669 -0.721908 0.780255
C  -4.617958 0.655325 0.528657
H  1.623065 0.676517 -1.870949
H  1.684141 -1.829555 -1.531493
H  2.105083 -2.538549 0.030626
H  2.768149 -0.806728 2.020896
H  1.111274 -0.16027 1.844223
H  4.007474 0.746689 -0.615177
H  3.624478 -0.621394 -1.667061
H  2.55776 1.560947 2.896282
H  3.674297 1.520392 1.506805
H  0.695156 2.327729 1.496616
H  2.089896 3.426719 1.248262
H  1.026396 2.930038 -2.218195
H  1.239287 4.150634 -0.934267
H  -1.226843 3.465717 -1.646899
H  -0.899999 3.64187 0.085155
H  -0.417401 -2.674202 -2.117172
H  -1.640972 -3.095144 -0.868784
H  4.878226 -0.823996 1.166958
H  4.382339 -2.239714 0.194709
H  5.666822 -1.156044 -0.392652
H  0.320613 -2.02157 1.905893
H  -2.864729 -2.318439 0.809786
H  -3.80533 2.578309 -0.101622
H  0.120325 -4.476445 0.046436
H  -5.156254 -1.366288 1.15212
H  -5.626933 1.04665 0.700999
