program: Gaussian 09
title: 000201166
version: EM64L-G09RevD.01
frameworkgroup: C1[X(C19H21N3)]
method: RPBEPBE
basis: SDD
operation: Freq
keyword: #pfreq=noraman
keyword: PBEPBE/SDD
title: #p freq=noraman PBEPBE/SDD
converged: YES YES NO NO
title: Mulliken charges:
elementType: N N N C C C C C C C C C C C C C C C C C C C H H H H H H H H H H H H H H H H H H H H H
charge: -0.364431 -0.476456 -0.151810 -0.307001 0.179148 0.146549 -0.471248 -0.437108 0.164232 0.197074 0.484263 -0.425332 -0.373580 -0.525393 -0.374990 -0.256388 -0.226188 -0.360351 -0.360235 0.395122 -0.646981 -0.647208 0.211745 0.203352 0.224827 0.188912 0.213598 0.265885 0.314023 0.229395 0.227836 0.233084 0.261366 0.215215 0.216420 0.234948 0.235529 0.231868 0.231545 0.216157 0.233680 0.215211 0.233716
chargesum: 0.00000
title: Mulliken charges with hydrogens summed into heavy atoms:
elementType: N N N C C C C C C C C C C C C C C C C C C C
charge: -0.098546 -0.162433 -0.151810 -0.095256 0.179148 0.146549 -0.043070 -0.034598 0.164232 0.197074 0.484263 -0.195937 -0.145745 -0.292309 -0.113624 -0.041172 -0.009768 -0.125404 -0.124706 0.395122 0.032589 0.035400
polarizability: 3.19261246e+02 -5.30835548e+00 2.18090614e+02 -1.93919701e+01 4.14839802e+00 1.66969124e+02
1716.lowfreq: -6.5090 -0.0007 -0.0003 0.0002 5.8630 7.6414 19.7868 29.1137 46.0955
frequency: 19.7391 29.0970 46.0932 77.1313 79.1021 101.0782 123.2943 129.7157 174.6493 192.9807 205.4957 210.0333 244.1029 258.4118 278.7211 305.4002 330.8010 348.8870 402.1564 419.2879 425.8160 431.5708 470.8033 479.4914 508.1893 529.9913 533.1059 551.5483 563.2493 579.6885 593.5119 631.3709 635.4876 659.5619 719.3068 727.9930 738.1266 746.8118 760.2769 771.6009 808.0529 819.3810 830.2759 838.2421 849.0370 883.9976 910.5421 925.3162 941.2999 944.2191 962.1699 964.8327 975.2418 1000.1634 1009.9654 1014.7197 1056.8686 1057.5876 1108.3814 1110.2776 1110.6231 1124.6205 1136.7938 1150.6475 1164.5600 1167.3531 1186.0069 1191.0915 1217.4950 1221.7319 1231.6979 1242.1355 1260.9663 1263.8082 1287.3789 1306.7135 1308.7099 1335.4319 1351.6966 1358.1837 1371.6435 1388.1989 1404.7568 1424.7316 1433.9983 1437.1101 1442.7837 1457.9780 1458.8577 1464.1922 1469.9158 1474.8244 1475.8472 1480.2984 1494.0493 1507.1686 1527.5233 1567.4421 1579.0307 1595.6892 1631.7082 1632.1148 2798.1097 2866.4478 2933.8691 2942.8894 2967.7361 2997.1576 3001.7148 3017.6612 3042.3190 3092.6359 3102.6119 3105.7443 3118.4216 3126.4597 3139.3222 3140.4111 3158.5860 3161.9107 3166.3895 3466.2800 3594.7904
redmass: 3.5203 4.3123 4.0243 3.6328 2.4714 2.8518 2.3159 3.2954 3.0898 3.2512 1.4315 1.9366 2.6990 3.4428 3.7770 3.8020 2.7110 4.6977 3.5804 3.0084 3.3863 3.4869 3.5378 2.8757 3.5837 1.3559 2.4661 3.4509 3.1936 3.3899 3.3531 4.8960 3.9125 3.1891 4.1242 3.3425 2.7189 1.3878 3.6578 4.5856 1.3293 1.9733 3.4500 3.1305 1.5709 3.8224 2.1631 1.3877 1.4344 2.9674 1.3596 1.2976 3.7812 2.8691 2.0187 2.4944 1.6627 1.6869 1.7785 1.2880 1.2682 1.6031 2.9945 2.2428 1.6183 1.2620 1.1935 1.2183 1.3613 1.6925 1.4679 1.7575 1.3124 2.9347 1.8466 2.0764 1.6392 1.5139 1.7313 3.2209 1.6693 3.9316 3.7145 1.9339 1.6085 1.5816 2.4006 1.1176 1.2050 1.0412 1.5023 1.0501 2.2356 3.0438 1.0831 1.1286 2.5326 6.5821 6.5966 7.0734 6.3007 6.9725 1.0790 1.0712 1.0369 1.0395 1.0597 1.0998 1.1022 1.1004 1.0905 1.0958 1.0937 1.0893 1.0844 1.0889 1.0878 1.0951 1.1001 1.0925 1.0943 1.0755 1.0802
irintensity: 0.0939 0.4075 0.5848 6.2264 0.3200 1.5394 0.2551 1.5150 0.8812 0.6854 0.1913 0.2163 1.2294 0.2549 3.4100 0.3133 3.6619 2.6063 1.6544 0.1876 1.2726 7.4157 7.1073 12.5439 21.9132 43.0462 47.5132 12.4739 28.4835 2.7946 6.8806 10.0390 32.3956 17.8089 0.7759 7.3797 0.9173 109.7270 6.5528 12.7368 15.3595 48.8676 23.7119 0.2257 0.3653 1.7990 4.1653 3.2000 0.5468 20.2143 0.3179 0.0218 4.2067 3.4994 8.1841 2.4689 15.2369 12.6747 4.6649 0.6428 0.3947 10.9534 32.2016 17.3737 10.6640 2.4045 9.4570 45.8664 7.2504 10.2472 5.8102 3.0994 34.9209 33.4253 33.5709 30.0733 16.7149 12.2905 49.0572 110.8381 28.4542 10.4664 30.7423 6.1732 14.1441 0.4790 14.6986 11.4166 10.7447 0.1706 22.1953 18.1952 19.1532 5.3045 2.0173 20.8363 282.6691 6.8789 0.7252 4.3554 184.0107 12.0904 72.6533 133.1732 118.8077 93.4703 47.6383 21.2769 73.1194 40.1445 62.3965 4.6202 55.2734 13.3723 1.2681 4.0145 6.3936 40.5015 41.1051 24.7690 11.0701 0.5366 53.7363
temp: 298.150 k
press: 1.00000 atm
elementType: 7 7 7 6 6 6 6 6 6 6 6 6 6 6 6 6 6 6 6 6 6 6 1 1 1 1 1 1 1 1 1 1 1 1 1 1 1 1 1 1 1 1 1
symmnumber: 1
zpe: 941001.9 jmol-1
zpe.correction: 0.358409 hartree
zpe.thermalcorrener: 0.377708 hartree
zpe.thermalcorrenthalpy: 0.378652 hartree
zpe.thermalcorrgfe: 0.309706 hartree
zpe.sumelectzpe: -899.298087 hartree
zpe.sumelectthermal: -899.278788 hartree
zpe.sumelectthermalent: -899.277844 hartree
zpe.sumelectthermalfe: -899.346790 hartree
dipole: 5.0163 -0.1011 -0.7384
dipole: 5.0714
quadrupole: -111.7083 -121.3639 -126.3645
quadrupole: -12.0235 -1.1272 0.6350
quadrupole: 8.1040 -1.5517 -6.5523 -12.0235 -1.1272 0.6350
hfenergy: -899.6564954 hartree
pointgroup: C01 [X(C19H21N3)]
dipole: -1.9681718 0.1336094 -0.298966 debye
polarizability: 318.3702147|-10.1866915|218.9750035|19.8455473|-3.6768981|166.9757664 unknown
InChI: InChI=1S/C19H21N3/c1-22(2)14-9-7-13(8-10-14)18-19-16(11-12-20-18)15-5-3-4-6-17(15)21-19/h3-10,18,20-21H,11-12H2,1-2H3
charge 0 multiplicity 1
43 atoms
N  0.197222 -2.782992 0.047086
N  1.265601 0.701514 -0.791985
N  -5.049378 1.066857 0.361609
C  0.013618 -1.550895 -0.767157
C  1.198114 -0.65915 -0.458545
C  2.382927 -1.052848 0.157997
C  2.597265 -2.47024 0.629563
C  1.54873 -3.388749 -0.048874
C  3.233265 0.119857 0.228649
C  2.502259 1.210854 -0.374487
C  -1.331544 -0.887308 -0.472036
C  4.536948 0.365738 0.734776
C  3.036629 2.51327 -0.471121
C  -2.201304 -0.496771 -1.517064
C  -1.732407 -0.615262 0.86069
C  5.075264 1.664884 0.638597
C  4.333105 2.727666 0.043478
C  -3.428206 0.148397 -1.25695
C  -2.951566 0.023472 1.142498
C  -3.834244 0.427489 0.086372
C  -5.930335 1.471504 -0.738949
C  -5.444362 1.329459 1.75018
H  0.035132 -1.776334 -1.867982
H  3.61617 -2.829574 0.382748
H  2.484853 -2.53567 1.730273
H  1.85996 -3.558907 -1.110045
H  1.520951 -4.371952 0.454899
H  -0.561851 -3.454056 -0.122357
H  0.486899 1.240298 -1.167215
H  5.116348 -0.442166 1.196552
H  2.471333 3.332997 -0.929197
H  -1.922425 -0.708707 -2.558203
H  -1.070926 -0.923538 1.677965
H  6.080309 1.867584 1.026029
H  4.778689 3.727225 -0.015983
H  -4.06939 0.425704 -2.098334
H  -3.220121 0.211588 2.186007
H  -6.265179 0.602692 -1.343099
H  -5.432468 2.188621 -1.424104
H  -6.826901 1.96353 -0.329782
H  -5.531928 0.393569 2.339621
H  -6.426164 1.828828 1.763676
H  -4.720198 1.990623 2.269302
