program: Gaussian 09
title: 000201162
version: EM64L-G09RevD.01
frameworkgroup: C1[X(C14H11N3O3S)]
method: RPBEPBE
basis: SDD
operation: Freq
keyword: #p
keyword: freq=noraman
keyword: PBEPBE/SDD
title: #p freq=noraman PBEPBE/SDD
converged: YES YES NO NO
title: Mulliken charges:
elementType: S O O O N N N C C C C C C C C C C C C C C H H H H H H H H H H H
charge: 0.911367 -0.561600 -0.545636 -0.250355 -0.243124 -0.119862 0.000455 0.404803 0.106637 -0.291977 0.026331 0.247248 -0.332255 -0.250045 -0.162815 -0.747721 -0.321585 -0.240789 -0.229374 -0.223297 -0.157163 0.277161 0.309086 0.298859 0.261337 0.279257 0.309455 0.262417 0.241964 0.245643 0.244233 0.251342
chargesum: 0.00000
title: Mulliken charges with hydrogens summed into heavy atoms:
elementType: S O O O N N N C C C C C C C C C C C C C C
charge: 0.911367 -0.561600 -0.545636 -0.250355 -0.243124 -0.119862 0.000455 0.404803 0.106637 -0.291977 0.026331 0.247248 -0.055094 0.059042 0.136044 0.102329 -0.059168 0.001175 0.016269 0.020936 0.094179
polarizability: 3.15889719e+02 3.92514664e+01 2.41893528e+02 -1.08975509e+01 1.73025052e+01 1.17776575e+02
1716.lowfreq: -8.7960 -4.9335 -0.0021 -0.0016 -0.0015 3.3403 21.1351 40.5497 63.2512
frequency: 20.9390 40.5349 63.2444 82.3329 102.9996 118.5814 144.3594 165.2325 176.8289 186.9311 206.2974 217.0609 237.5875 247.3126 259.9773 283.6578 304.6124 333.4278 339.4736 373.0132 400.5247 423.3662 455.2930 469.7356 513.9165 558.0212 569.8567 580.3185 586.9056 634.3523 641.3161 687.8528 698.3772 733.4826 744.2601 755.7942 770.3011 778.6746 789.0886 844.0555 870.1607 875.0786 885.0807 923.6891 958.4417 962.8294 977.5254 987.2899 995.8746 1003.0151 1011.6604 1018.6547 1030.4047 1061.8605 1110.4062 1127.0079 1151.6075 1177.5379 1196.2434 1238.6947 1245.8882 1267.8527 1284.0755 1297.5414 1313.2400 1332.3097 1365.6688 1379.4044 1407.3576 1416.5388 1425.9815 1434.8737 1437.8582 1478.4886 1514.5846 1535.2061 1562.1949 1604.5906 1633.0002 3017.4893 3134.6139 3147.2440 3163.3817 3165.6487 3174.4347 3177.6936 3183.7421 3183.8946 3194.7245 3206.3166
redmass: 8.2398 7.1911 4.9072 5.4339 5.6669 4.5911 7.6976 4.9247 1.1267 5.9531 5.5131 6.2132 8.2731 4.6405 6.0329 7.1115 8.0995 8.1450 5.4376 7.1337 8.6962 3.7806 4.3340 4.3500 4.6606 5.5118 3.8454 7.6072 7.8343 6.9313 7.5237 6.1338 5.6805 2.5197 5.5177 4.2115 1.4654 1.8537 12.7852 6.2617 1.3905 1.4788 3.6709 7.6114 1.3578 1.3760 1.9864 1.3175 1.6455 1.8439 2.0744 1.7079 4.1738 2.4397 1.7564 1.6736 1.2751 1.0800 3.0513 3.4714 3.2504 1.6913 1.1597 2.8240 3.5735 3.4885 4.3776 5.8782 1.0580 2.8757 2.4089 1.3563 1.7471 3.6048 5.5910 5.8341 5.6737 6.9688 6.9542 1.0236 1.0880 1.0899 1.0890 1.0962 1.1082 1.1081 1.0908 1.0968 1.0968 1.1004
irintensity: 0.8759 4.2720 2.2963 5.5309 0.9284 6.7787 0.1318 0.7880 0.3241 7.1222 0.9247 6.7758 0.5820 0.4282 0.2950 7.5119 6.9338 8.1823 8.9664 1.6822 47.0167 1.3495 5.2249 18.6668 3.6354 6.2721 0.9341 26.7103 9.7665 2.3527 5.8763 1.0492 2.4535 11.2118 31.3769 4.1235 120.7292 26.2449 63.9788 4.0917 0.0488 5.0907 41.1396 5.0756 2.0937 3.6742 31.2240 0.1819 12.3565 6.1239 0.9727 74.4006 6.3052 31.7734 10.7267 1.4852 23.9827 1.4065 33.0287 33.2703 183.1020 8.1155 24.4508 176.6079 25.2393 6.4863 26.2676 24.0667 5.2312 115.8425 43.2952 6.9664 5.4231 64.5623 6.3705 4.5790 1.5577 19.8289 21.0319 15.5276 10.8420 0.1520 4.7105 20.6761 6.3077 5.1462 3.5487 7.4730 0.8156 4.6264
temp: 298.150 k
press: 1.00000 atm
elementType: 16 8 8 8 7 7 7 6 6 6 6 6 6 6 6 6 6 6 6 6 6 1 1 1 1 1 1 1 1 1 1 1
symmnumber: 1
zpe: 590888.2 jmol-1
zpe.correction: 0.225057 hartree
zpe.thermalcorrener: 0.243589 hartree
zpe.thermalcorrenthalpy: 0.244533 hartree
zpe.thermalcorrgfe: 0.177815 hartree
zpe.sumelectzpe: -1326.368530 hartree
zpe.sumelectthermal: -1326.349999 hartree
zpe.sumelectthermalent: -1326.349054 hartree
zpe.sumelectthermalfe: -1326.415773 hartree
dipole: -4.7936 -0.7811 -6.1415
dipole: 7.8299
quadrupole: -99.4200 -130.8443 -138.7652
quadrupole: 18.7236 -8.8826 4.9550
quadrupole: 23.5898 -7.8345 -15.7553 18.7236 -8.8826 4.9550
hfenergy: -1326.5935874 hartree
pointgroup: C01 [X(C14H11N3O3S1)]
dipole: 1.9791692 0.4492124 2.3174748 debye
polarizability: 325.384881|-29.0085658|220.4325612|-8.531813|-38.4723246|129.7423793 unknown
InChI: InChI=1S/C14H11N3O3S/c1-21(19,20)11-7-3-2-6-10(11)13-14(16-18)17-9-5-4-8-12(17)15-13/h2-9H,1H3
charge 0 multiplicity 1
32 atoms
S  -1.762852 -2.249655 -0.100707
O  -3.177457 -3.018879 -0.417935
O  -0.558483 -2.282463 -1.20313
O  0.017983 3.033956 -1.658792
N  2.304287 0.661979 -0.283544
N  0.715955 -0.500035 0.890406
N  1.106803 2.352733 -1.445479
C  -1.372383 0.679389 0.261729
C  0.091857 0.515173 0.206162
C  -2.277299 -0.41511 0.266429
C  1.054516 1.300021 -0.536829
C  2.057872 -0.416824 0.594211
C  -1.945624 1.978947 0.356745
C  -3.66706 -0.261511 0.3668
C  3.564206 0.970919 -0.755829
C  -1.140386 -2.982613 1.550687
C  3.145889 -1.214805 1.020898
C  -3.338542 2.155632 0.487461
C  -4.204251 1.040158 0.497932
C  4.637291 0.184835 -0.346076
C  4.430236 -0.912417 0.549697
H  -1.286012 2.848879 0.31887
H  -4.305265 -1.149784 0.294372
H  3.626179 1.82145 -1.436945
H  -1.996209 -2.948154 2.238798
H  -0.851687 -4.01338 1.300034
H  -0.29911 -2.344382 1.850525
H  2.95242 -2.049237 1.698043
H  -3.746482 3.168643 0.56418
H  -5.287322 1.176201 0.582058
H  5.63609 0.417974 -0.721967
H  5.283436 -1.521038 0.863199
