program: Gaussian 09
title: 000201147
version: EM64L-G09RevD.01
frameworkgroup: C1[X(C19H25N)]
method: RPBEPBE
basis: SDD
operation: Freq
keyword: #pfreq=noraman
keyword: PBEPBE/SDD
title: #p freq=noraman PBEPBE/SDD
converged: YES YES NO NO
title: Mulliken charges:
elementType: N C C C C C C C C C C C C C C C C C C C H H H H H H H H H H H H H H H H H H H H H H H H H
charge: -0.104831 -0.350585 -0.431047 -0.378202 0.507772 0.456917 -0.323885 -0.323017 -0.457415 -0.401662 -0.382229 -0.419989 -0.678564 -0.675403 -0.228836 -0.231972 -0.232137 -0.249042 -0.248009 -0.245274 0.207671 0.202687 0.219951 0.173302 0.227824 0.185800 0.205907 0.184098 0.200295 0.231202 0.233849 0.242791 0.249460 0.226878 0.207675 0.204837 0.225505 0.218339 0.203598 0.223798 0.222855 0.223156 0.222504 0.226870 0.226556
chargesum: 0.00000
title: Mulliken charges with hydrogens summed into heavy atoms:
elementType: N C C C C C C C C C C C C C C C C C C C
charge: -0.104831 -0.142914 -0.008408 0.022924 0.507772 0.456917 0.067822 0.061376 -0.226213 -0.167813 -0.139438 -0.170529 -0.039174 -0.027962 -0.005038 -0.009117 -0.008981 -0.026538 -0.021139 -0.018718
polarizability: 2.12512947e+02 -1.35178428e+01 2.28506829e+02 3.06853273e+00 -1.40293734e+01 1.75301224e+02
1716.lowfreq: -7.4810 -0.0004 -0.0002 0.0001 5.9462 6.9788 15.3075 22.4593 33.5253
frequency: 14.3919 22.4060 33.5006 36.9641 50.1162 58.2261 78.5973 80.5503 101.5415 161.8057 179.2329 182.7013 216.2972 219.3957 249.3698 261.4312 285.9781 292.5470 319.3125 386.4111 402.3827 403.4949 428.8609 465.4530 471.2662 492.6272 560.4823 582.2733 614.2650 617.1805 630.9278 704.1630 706.5316 725.8309 748.8095 760.3801 777.3751 795.0050 795.7891 824.7052 849.8916 853.1297 853.9298 913.3344 922.0640 925.8588 975.8846 976.5962 986.6238 989.4399 990.7086 993.4059 993.5917 1008.8544 1027.7318 1029.1233 1041.4605 1058.3886 1073.9419 1079.8074 1081.5033 1084.7197 1091.1806 1111.3308 1154.5210 1170.6860 1171.5783 1187.6842 1190.1254 1192.7777 1203.8308 1206.3234 1228.9463 1246.2022 1278.9148 1288.2415 1295.0685 1303.7175 1313.4755 1335.5659 1340.1164 1362.1359 1368.2434 1377.7254 1382.3355 1383.9993 1385.8407 1387.4429 1436.9120 1440.7302 1458.5374 1460.5109 1465.5590 1471.1990 1478.4079 1479.9309 1483.4517 1484.9502 1487.9089 1491.8800 1590.1442 1592.6595 1608.8595 1614.1206 2834.3780 2844.5609 2857.7465 2961.3459 2982.2563 2982.7431 2984.6198 3027.7442 3031.6971 3039.0696 3058.3043 3074.1742 3075.9993 3090.8438 3091.1687 3111.0303 3113.8218 3119.7867 3123.1058 3132.0206 3136.6300 3142.9161 3149.4682 3161.0222 3162.5839
redmass: 3.4262 3.6618 3.7440 3.9250 3.0778 4.3320 2.8421 2.0512 2.7166 1.6570 2.0659 2.0967 2.7305 1.8761 2.8613 2.4647 2.3946 2.9822 2.8219 3.0168 2.8141 2.8210 3.0987 2.9209 3.3133 3.0856 3.2456 3.5445 5.7109 6.3405 4.4547 1.7581 1.6704 2.6502 2.5754 1.6170 1.9667 1.1618 1.2081 1.7975 2.7215 1.2828 1.2632 1.7965 1.5125 1.5548 1.3963 1.3985 2.4171 4.7323 5.5210 1.3398 1.3442 2.5120 2.2665 1.9445 2.7962 2.4376 1.9445 1.6842 2.3895 2.0657 1.7741 1.8664 1.6418 1.0632 1.0521 1.1123 2.5325 1.1459 2.2451 2.1802 1.6129 1.4079 1.1996 1.2691 1.3187 1.1822 1.4516 1.2753 1.3128 1.3319 1.3354 2.6063 2.2572 5.3164 1.2441 1.2353 2.2130 2.1403 1.0669 1.0543 1.0865 1.0593 1.0862 2.1024 1.3477 1.5293 1.0809 1.0737 6.0392 5.9686 6.0671 6.0364 1.0717 1.0723 1.0712 1.0822 1.0357 1.0357 1.0600 1.0864 1.0873 1.0911 1.0970 1.0983 1.0980 1.1002 1.1004 1.0872 1.0865 1.0858 1.0864 1.0909 1.0924 1.0959 1.0945 1.1014 1.1009
irintensity: 0.0825 0.0082 0.0247 0.0076 0.0790 0.0667 0.1925 0.2619 0.0734 1.0630 0.7362 0.6321 0.6215 0.7142 0.2663 0.2401 1.2710 0.7373 0.6267 2.5438 0.2196 0.0937 3.0360 6.5519 2.4489 1.6633 28.4152 11.9602 2.3382 0.9405 3.6961 44.3216 65.7975 4.9269 20.7018 48.5772 22.5212 6.3203 3.0892 0.3539 1.4483 0.2904 0.0937 1.4248 3.5725 0.8336 0.0551 0.1443 6.4577 0.5456 0.6315 0.4678 0.2241 1.4473 11.0758 4.1597 0.9510 17.0917 17.6724 3.8903 31.4851 6.9758 21.7720 13.1034 21.9740 0.0753 0.1145 0.3137 0.0570 1.7717 24.0710 11.6904 8.9320 0.5114 0.2761 14.8409 10.1352 24.4509 6.5620 0.9787 0.2340 2.9242 4.1041 0.3424 1.9197 0.2034 21.8123 19.2905 9.7504 5.9015 3.4122 7.8786 3.4747 0.6133 4.5883 21.1622 13.2149 16.7024 9.2549 10.0669 3.6676 0.0486 14.7788 6.5533 46.9359 31.5138 224.6795 17.6437 43.6297 22.8010 25.1744 11.0386 27.3917 4.4365 46.9939 44.6012 78.7046 41.3307 41.4764 9.6148 6.9647 1.6899 0.1328 11.7301 24.0458 40.3344 40.4711 29.2150 18.8385
temp: 298.150 k
press: 1.00000 atm
elementType: 7 6 6 6 6 6 6 6 6 6 6 6 6 6 6 6 6 6 6 6 1 1 1 1 1 1 1 1 1 1 1 1 1 1 1 1 1 1 1 1 1 1 1 1 1
symmnumber: 1
zpe: 1021260.2 jmol-1
zpe.correction: 0.388977 hartree
zpe.thermalcorrener: 0.409265 hartree
zpe.thermalcorrenthalpy: 0.410209 hartree
zpe.thermalcorrgfe: 0.336598 hartree
zpe.sumelectzpe: -792.261049 hartree
zpe.sumelectthermal: -792.240761 hartree
zpe.sumelectthermalent: -792.239817 hartree
zpe.sumelectthermalfe: -792.313428 hartree
dipole: -0.5025 0.1990 -0.7234
dipole: 0.9030
quadrupole: -118.5161 -116.9192 -116.6631
quadrupole: -1.3191 2.5706 -2.4906
quadrupole: -1.1500 0.4469 0.7031 -1.3191 2.5706 -2.4906
hfenergy: -792.6500264 hartree
pointgroup: C01 [X(C19H25N1)]
dipole: -0.2042917 0.0509526 -0.2861697 debye
polarizability: 214.1337567|-14.2242877|225.2261139|4.3175077|-16.5579781|176.9611287 unknown
InChI: InChI=1S/C19H25N/c1-3-20(4-2)16-15-19(17-11-7-5-8-12-17)18-13-9-6-10-14-18/h5-14,19H,3-4,15-16H2,1-2H3
charge 0 multiplicity 1
45 atoms
N  -3.272891 -0.879899 -0.016849
C  0.523521 -0.245156 -0.667396
C  -0.757953 -0.846117 -0.021587
C  -2.058959 -0.266011 -0.615142
C  0.621414 1.266001 -0.395609
C  1.815578 -0.968393 -0.249897
C  -3.601016 -2.201225 -0.618335
C  -4.43793 0.046046 0.005725
C  0.347275 2.207372 -1.41915
C  2.997775 -0.750768 -1.006881
C  0.958795 1.749858 0.895486
C  1.889453 -1.830841 0.872819
C  -4.396743 -3.115477 0.333228
C  -4.316256 1.134892 1.089322
C  0.405469 3.597472 -1.164162
C  4.213901 -1.375106 -0.659003
C  1.014746 3.136113 1.155911
C  3.107351 -2.457817 1.227639
C  0.737816 4.067302 0.126537
C  4.274335 -2.233727 0.464667
H  0.421483 -0.36876 -1.766657
H  -0.743958 -1.945399 -0.157878
H  -0.769287 -0.656049 1.068107
H  -2.046044 -0.383052 -1.73076
H  -2.082223 0.820198 -0.418326
H  -4.157631 -2.081504 -1.583569
H  -2.648859 -2.703577 -0.870423
H  -4.598865 0.523715 -0.995066
H  -5.342095 -0.554977 0.213236
H  0.087504 1.849579 -2.423797
H  2.960661 -0.077458 -1.872689
H  1.194123 1.036166 1.694237
H  0.996075 -2.024898 1.475392
H  -3.828894 -3.27286 1.266681
H  -5.376412 -2.680248 0.60178
H  -4.585823 -4.09752 -0.139838
H  -4.219959 0.66817 2.08507
H  -3.43256 1.778556 0.929584
H  -5.210322 1.786538 1.085859
H  0.19252 4.309795 -1.969637
H  5.112602 -1.193601 -1.259709
H  1.279942 3.491988 2.158217
H  3.142345 -3.121732 2.099279
H  0.785056 5.143486 0.327735
H  5.21714 -2.720377 0.738848
