program: Gaussian 09
title: 000201150
version: EM64L-G09RevD.01
frameworkgroup: C1[X(C10H15ClNO5PS2)]
method: RPBEPBE
basis: SDD
operation: Freq
keyword: #p
keyword: freq=noraman
keyword: PBEPBE/SDD
title: #p freq=noraman PBEPBE/SDD
converged: YES YES NO NO
title: Mulliken charges:
elementType: Cl S S P O O O O O N C C C C C C C C C C H H H H H H H H H H H H H H H
charge: -0.003835 0.985631 -0.205255 0.877479 -0.481650 -0.530496 -0.530482 -0.454337 -0.468543 -0.233541 -0.112533 -0.211715 -0.210824 0.486748 -0.290402 -0.290891 -0.618211 -0.617529 -0.478184 -0.473971 0.310992 0.287972 0.290561 0.213460 0.252331 0.276539 0.277426 0.252142 0.213955 0.249544 0.241454 0.254921 0.249404 0.241575 0.250269
chargesum: 0.00000
title: Mulliken charges with hydrogens summed into heavy atoms:
elementType: Cl S S P O O O O O N C C C C C C C C C C
charge: -0.003835 0.985631 -0.205255 0.877479 -0.481650 -0.530496 -0.530482 -0.454337 -0.468543 -0.233541 -0.112533 0.099277 0.077148 0.486748 -0.290402 -0.000330 0.124119 0.125994 0.267734 0.267276
polarizability: 2.73836751e+02 1.22716255e+01 2.07523410e+02 -7.61159288e+00 6.09456428e+00 1.74145025e+02
1716.lowfreq: -10.4804 0.0014 0.0021 0.0022 1.8945 7.1110 10.4431 21.2121 33.5155
frequency: 8.1864 21.0191 33.4779 33.8304 47.5062 53.8397 61.6077 75.8896 106.8398 112.5603 113.2419 123.1464 137.6444 153.2188 163.6662 173.6975 203.9023 212.2287 219.7743 233.9682 237.1842 244.1730 256.0693 264.0364 294.5821 296.0476 332.3036 354.6455 373.6181 378.5523 399.2975 414.6111 428.6058 449.9439 456.0051 480.6295 510.1272 564.0665 593.1158 643.2081 689.7301 699.5579 717.0654 724.7338 808.7542 837.4724 842.4385 856.6600 896.0245 951.6494 955.8242 965.7488 968.3127 1015.4413 1030.2243 1053.3136 1080.9819 1108.9310 1113.4871 1116.6248 1130.8195 1131.8870 1137.3750 1173.1179 1207.3662 1210.5959 1243.3755 1368.4948 1380.1447 1406.5990 1418.0841 1423.0858 1424.4558 1447.5487 1456.3651 1458.0390 1459.5385 1464.4000 1469.1551 1469.8903 1471.0076 1477.3795 1573.9309 1578.8528 2919.7279 2923.3606 2988.9641 2991.0733 3042.1230 3044.1680 3097.3105 3098.0881 3098.9362 3099.9437 3138.2412 3141.4924 3155.5564 3162.7388 3172.0333
redmass: 5.5165 6.7682 5.5957 5.2788 3.3586 3.5469 3.7630 4.6208 4.6474 1.5650 8.2199 2.2303 1.2959 3.0918 5.4138 5.9971 4.6887 5.1964 4.5163 1.1238 4.6063 1.4615 6.8396 5.8134 4.0036 7.7703 7.7430 5.3312 5.5486 5.5150 4.1564 7.1892 9.5503 3.7459 8.7186 6.8099 7.9574 7.4356 5.9250 8.0996 11.0977 11.8414 9.9137 4.5485 15.6117 7.3445 1.4047 4.3642 1.3849 11.3609 13.8492 11.2380 1.3677 1.4395 6.7205 2.1961 1.2275 1.3711 1.2402 1.2428 1.2981 1.2921 1.3176 5.0528 1.7731 2.7837 1.3996 4.0998 7.7210 1.1274 1.1393 1.1232 1.1200 2.4862 1.0468 1.0567 1.0493 1.0502 1.0527 1.0520 1.0448 1.0573 6.8460 8.7383 1.0464 1.0458 1.0303 1.0299 1.0875 1.0863 1.1045 1.0985 1.1051 1.0996 1.1040 1.1040 1.0888 1.0927 1.0976
irintensity: 1.7560 0.2720 2.1731 0.5857 4.5322 2.4942 5.0846 2.9912 2.0650 0.7460 2.2520 2.1366 0.7387 3.6077 1.1618 2.4120 0.9825 0.2384 2.8387 0.4295 15.1147 0.6924 19.2241 4.2506 3.9189 10.3515 1.2582 6.8873 7.7895 12.4959 6.6434 4.0049 56.6299 6.4141 37.6787 95.7155 24.4579 95.3981 52.0721 38.7961 81.3083 136.5483 83.4111 19.7732 50.9252 193.5034 34.7479 43.8078 8.0088 232.9408 61.2761 144.1111 3.4652 0.5548 48.7597 37.1207 0.0531 20.5838 0.1940 0.3863 0.9303 0.1768 16.0743 11.8752 50.7231 167.3752 35.9252 27.3331 12.4555 26.0084 2.7034 5.1599 6.3026 150.4728 21.5380 19.3636 16.0894 4.0260 21.2405 17.7640 9.4575 38.3133 29.2980 9.5219 21.2450 78.4815 45.7483 33.0187 4.7402 38.6680 20.6817 1.7733 17.1296 1.8392 9.4580 10.6612 0.6945 9.1925 3.1841
temp: 298.150 k
press: 1.00000 atm
elementType: 17 16 16 15 8 8 8 8 8 7 6 6 6 6 6 6 6 6 6 6 1 1 1 1 1 1 1 1 1 1 1 1 1 1 1
symmnumber: 1
zpe: 644478.0 jmol-1
zpe.correction: 0.245469 hartree
zpe.thermalcorrener: 0.270536 hartree
zpe.thermalcorrenthalpy: 0.271481 hartree
zpe.thermalcorrgfe: 0.186429 hartree
zpe.sumelectzpe: -2416.584895 hartree
zpe.sumelectthermal: -2416.559828 hartree
zpe.sumelectthermalent: -2416.558884 hartree
zpe.sumelectthermalfe: -2416.643935 hartree
dipole: 6.2384 -2.3892 3.8742
dipole: 7.7224
quadrupole: -159.6767 -135.8336 -154.1326
quadrupole: 1.6705 -19.0666 2.7636
quadrupole: -9.7957 14.0474 -4.2517 1.6705 -19.0666 2.7636
hfenergy: -2416.8303641 hartree
pointgroup: C01 [X(C10H15Cl1N1O5P1S2)]
dipole: 2.4237581 -0.7649801 1.66465 debye
polarizability: 273.8223967|12.5885781|208.7255396|-5.9819612|3.3607233|172.9572499 unknown
InChI: InChI=1S/C10H15ClNO5PS2/c1-12(2)20(13,14)8-5-6-10(9(11)7-8)17-18(19,15-3)16-4/h5-7H,1-4H3
charge 0 multiplicity 1
35 atoms
Cl 0.753513 3.181662 -0.095953
S  -3.788391 -0.082658 -0.557327
S  3.004714 -0.386478 2.311814
P  3.406924 -0.209831 0.304112
O  2.243604 0.643724 -0.700014
O  -4.42072 1.3864 -0.844897
O  -4.122816 -1.404432 -1.4415
O  4.813606 0.635619 -0.190643
O  3.551021 -1.64589 -0.631861
N  -4.320338 -0.518138 1.210102
C  -1.899601 0.123492 -0.581254
C  -1.378528 1.410323 -0.364673
C  -1.103629 -1.007837 -0.831612
C  0.860359 0.434261 -0.610598
C  0.02125 1.552737 -0.375085
C  0.29551 -0.841641 -0.848793
C  -3.781859 -1.837773 1.611592
C  -4.037297 0.602891 2.135589
C  5.070794 1.977318 0.396438
C  4.437276 -2.728816 -0.131423
H  -2.041965 2.269304 -0.223146
H  -1.566951 -1.975499 -1.046848
H  0.966974 -1.679815 -1.060901
H  -2.705109 -1.822199 1.894194
H  -4.369616 -2.177857 2.483332
H  -3.947336 -2.554641 0.790372
H  -4.378561 1.543154 1.671935
H  -4.641342 0.433983 3.045304
H  -2.967626 0.689121 2.431694
H  6.073392 2.245123 0.03416
H  5.058178 1.928236 1.500392
H  4.319274 2.697035 0.030414
H  4.189056 -3.598598 -0.756416
H  4.229183 -2.94599 0.93235
H  5.493259 -2.442791 -0.270348
