program: Gaussian 09
title: 000201097
version: EM64L-G09RevD.01
frameworkgroup: C1[X(C7H13NO2)]
method: RPBEPBE
basis: SDD
operation: Freq
keyword: #p
keyword: freq=noraman
keyword: PBEPBE/SDD
title: #p freq=noraman PBEPBE/SDD
converged: YES YES NO NO
title: Mulliken charges:
elementType: O O N C C C C C C C H H H H H H H H H H H H H
charge: -0.422709 -0.227235 -0.089448 -0.398150 -0.391633 -0.385064 -0.371820 -0.374818 -0.395471 0.210948 0.188451 0.215212 0.206537 0.193446 0.193742 0.208468 0.252639 0.170192 0.172274 0.219142 0.232179 0.213846 0.379273
chargesum: 0.00000
title: Mulliken charges with hydrogens summed into heavy atoms:
elementType: O O N C C C C C C C
charge: -0.043436 -0.227235 -0.089448 0.005513 0.008349 0.017146 0.051012 0.016599 0.050553 0.210948
polarizability: 1.01655362e+02 -2.40915106e-01 8.71638788e+01 -2.96397989e+00 9.97752057e-01 7.17259206e+01
1716.lowfreq: -17.0691 -0.0010 -0.0004 0.0004 4.9681 15.4306 39.7044 49.3872 92.3767
frequency: 39.5023 49.2729 92.2305 177.4342 235.2596 288.3993 294.4471 371.3499 378.4744 414.8139 449.6972 506.9023 558.6382 611.9420 689.6348 765.0248 804.5503 825.7187 852.8211 857.5855 903.2784 953.2682 963.4569 996.3236 1043.4800 1054.8639 1095.2610 1107.4445 1126.6063 1150.5849 1158.0612 1192.0726 1256.5685 1261.2801 1273.4154 1293.3655 1316.1573 1328.4186 1336.3290 1341.7941 1351.8870 1368.9575 1383.7101 1449.9406 1451.5200 1460.4968 1466.6702 1470.4027 1481.5827 1670.5795 2823.8616 2834.1522 2907.1476 2966.8644 2988.0221 2988.3430 3029.3401 3035.5186 3048.1537 3056.2535 3060.9252 3080.9743 3500.4748
redmass: 5.8462 4.5790 3.7984 3.1136 1.8893 2.5551 3.6967 3.0178 1.7439 2.7692 2.6714 2.0496 2.6520 1.3737 2.8735 4.1685 1.4777 4.7951 2.5118 1.5335 2.4092 1.7028 1.4845 2.5402 2.1933 1.8282 1.9071 1.7576 2.4407 1.3364 2.1664 1.2919 1.5216 1.3216 1.3602 1.3094 1.7187 1.3400 1.4343 1.4120 1.5055 1.4223 1.4172 1.0844 1.0882 1.0874 1.0940 1.0791 1.0935 8.5416 1.0715 1.0702 1.0692 1.0628 1.0627 1.0597 1.0895 1.0948 1.1029 1.1008 1.0912 1.0909 1.0638
irintensity: 1.2747 0.0500 0.1588 1.3307 0.7194 2.1058 2.0017 2.9010 3.1267 5.9265 0.6800 22.6322 28.3765 88.5867 74.7481 12.1453 0.0738 25.2449 4.0469 9.1791 5.2072 8.2652 19.7464 26.9911 12.5022 155.9673 28.7380 53.2926 3.9932 5.7179 14.2269 2.9312 0.5761 3.4882 9.4673 2.5767 41.4843 3.8859 3.2994 0.2141 2.3200 0.4222 2.8586 10.7175 2.9146 14.1939 17.2067 2.0222 8.5326 251.2278 46.7199 160.5876 87.3350 39.2616 18.8958 47.0084 54.2614 47.7651 24.8478 68.3750 31.8001 11.8411 15.4991
temp: 298.150 k
press: 1.00000 atm
elementType: 8 8 7 6 6 6 6 6 6 6 1 1 1 1 1 1 1 1 1 1 1 1 1
symmnumber: 1
zpe: 516137.8 jmol-1
zpe.correction: 0.196587 hartree
zpe.thermalcorrener: 0.206616 hartree
zpe.thermalcorrenthalpy: 0.207560 hartree
zpe.thermalcorrgfe: 0.160254 hartree
zpe.sumelectzpe: -478.926509 hartree
zpe.sumelectthermal: -478.916480 hartree
zpe.sumelectthermalent: -478.915536 hartree
zpe.sumelectthermalfe: -478.962842 hartree
dipole: -1.5314 1.0858 1.3539
dipole: 2.3146
quadrupole: -62.0403 -59.6695 -61.2307
quadrupole: 6.7235 2.0062 -4.3496
quadrupole: -1.0601 1.3107 -0.2506 6.7235 2.0062 -4.3496
hfenergy: -479.123096 hartree
pointgroup: C01 [X(C7H13N1O2)]
dipole: -0.5342828 -0.3721374 -0.6366323 debye
dipolederiv: -0.4740163 0.2298637 0.145167 0.1939422 -1.0727015 -0.2296696 0.1019079 -0.1305665 -0.3463335 -0.6524665 -0.1704504 -0.2787168 -0.0049548 -0.665114 -0.1291804 -0.3588673 -0.3235751 -0.6314466 -0.7268698 0.0205531 -0.0415311 0.0141751 -0.5058853 0.0334249 0.0157925 -0.0197656 -0.5306179 0.0743686 0.0128707 0.0068925 0.0095079 0.0301782 -0.0288698 0.0465798 -0.0160059 0.1451638 0.0324677 -0.0225063 0.0187858 -0.0168686 0.0709331 0.0252675 0.0139506 -0.009431 0.1175938 0.021672 -0.0239617 0.0331944 -0.0126299 0.0649822 -0.0222322 0.0152297 0.0050747 0.1094974 0.0572469 0.1151339 0.1307814 0.1877176 0.3731929 0.0917564 0.0868358 0.0821311 0.4510346 0.4009818 -0.232525 0.0724344 -0.3312272 0.2722851 -0.0662162 0.0055416 -0.0620326 0.3498914 0.3351116 0.1276598 -0.1798856 0.0799399 0.0735954 -0.0364499 -0.0499995 -0.0070527 0.3433449 0.9098842 -0.1326417 0.4149182 -0.2078949 1.3310716 0.3723938 0.4901774 0.4469071 0.651634 0.053264 0.02217 -0.0449877 0.0414114 0.0211803 0.0325745 -0.1185956 0.0095803 -0.1736155 -0.1465093 -0.0853419 0.0958579 -0.0948597 0.0086008 0.0380761 0.129819 0.0476781 0.0221864 0.019788 0.0363988 -0.042872 0.0271313 0.0723177 0.0229253 -0.026806 0.0928835 -0.1503515 0.0202488 -0.0568005 -0.0119976 -0.0556864 -0.1683511 -0.0907965 -0.0222501 -0.1285334 0.0304921 -0.1130553 0.1334042 0.0165269 0.1331468 -0.0872806 -0.0131308 -0.0106412 0.0131628 0.0812978 0.0629587 -0.028556 -0.0702633 -0.0346525 0.0463646 0.0527257 -0.0172358 0.0044327 -0.1595442 -0.0168416 0.102895 0.0212105 0.0876706 -0.0068841 -0.0046404 -0.0045479 -0.0037089 0.0654325 -0.0082813 -0.0641931 -0.0791034 -0.0524297 -0.0287737 0.0817745 -0.0698189 -0.0667066 -0.2844206 -0.0959157 0.0863585 -0.0336419 0.0817362 -0.0038022 0.0246583 -0.1227954 0.1569452 -0.2443401 0.0137916 -0.0964654 -0.033637 -0.0393672 -0.1337834 -0.065922 -0.0359309 -0.079815 0.0383639 0.0476791 0.0084251 -0.0121256 -0.0267729 -0.0918218 0.0051293 -0.022554 -0.0444618 0.085293 -0.0476445 -0.0151763 0.0153577 0.0191475 0.0837416 -0.0806108 0.1524701 0.0188463 -0.1891705 0.2321372 0.0328856 -0.1423648 0.0018174 0.3159541 -0.0129877 -0.1982616 0.0140131 0.2186147 unknown
polarizability: 101.1790227|0.8398952|86.3075148|4.2845579|4.1091073|73.0586237 unknown
InChI: InChI=1S/C7H13NO2/c9-7(10)6-8-4-2-1-3-5-8/h9H,1-6H2
charge 0 multiplicity 1
23 atoms
O  2.659157 -0.951026 -0.092011
O  2.938414 1.008021 1.120879
N  -0.103479 0.351593 -0.131528
C  -2.886744 -0.58237 -0.057717
C  -1.694017 -1.565628 -0.039057
C  -2.46237 0.777434 0.542956
C  -0.466693 -0.952314 -0.7424
C  -1.217107 1.333072 -0.178086
C  1.181595 0.897386 -0.62872
C  2.335369 0.379597 0.225801
H  -3.224217 -0.433051 -1.104692
H  -3.744699 -1.00123 0.501296
H  -1.423534 -1.800678 1.008464
H  -1.961923 -2.516628 -0.538441
H  -3.285891 1.513557 0.468249
H  -2.220999 0.64929 1.615685
H  0.401587 -1.628195 -0.662555
H  -0.694233 -0.8256 -1.835019
H  -1.491386 1.58889 -1.236177
H  -0.883014 2.264854 0.314302
H  1.180868 1.994056 -0.517525
H  1.370574 0.653808 -1.700115
H  3.376342 -1.266837 0.523316
