program: Gaussian 09
title: 000201116
version: EM64L-G09RevD.01
frameworkgroup: C1[X(C11H16NO5PS)]
method: RPBEPBE
basis: SDD
operation: Freq
keyword: #p
keyword: freq=noraman
keyword: PBEPBE/SDD
title: #p freq=noraman PBEPBE/SDD
converged: YES YES NO NO
title: Mulliken charges:
elementType: S P O O O O O N C C C C C C C C C C C H H H H H H H H H H H H H H H H
charge: -0.205313 0.855375 -0.481557 -0.492157 -0.451022 -0.218988 -0.210488 0.020827 0.024372 0.395778 0.429249 -0.649255 -0.659286 -0.484373 0.199079 -0.366982 -0.340713 -0.770519 -0.478341 0.231891 0.214012 0.239968 0.233030 0.211520 0.230515 0.234075 0.271332 0.264910 0.290869 0.212603 0.254317 0.258121 0.249112 0.245966 0.242072
chargesum: 0.00000
title: Mulliken charges with hydrogens summed into heavy atoms:
elementType: S P O O O O O N C C C C C C C C C C C
charge: -0.205313 0.855375 -0.481557 -0.492157 -0.451022 -0.218988 -0.210488 0.020827 0.256263 0.395778 0.429249 0.037755 0.016825 -0.213041 0.199079 -0.102073 -0.049843 -0.045478 0.258808
polarizability: 2.68496340e+02 -5.59290353e+00 1.91491263e+02 5.88941250e-01 1.67349980e+01 1.41486740e+02
1716.lowfreq: -17.9717 -6.4696 -4.4588 -0.0028 -0.0020 -0.0016 8.1840 10.9396 20.3416
frequency: -3.9521 9.9470 20.3235 24.6992 37.4384 49.5817 73.6493 88.3772 102.5087 108.1885 142.2037 171.1142 180.5625 184.0341 211.7360 220.7787 227.6888 235.0573 262.7872 272.9041 293.5312 313.2467 330.6014 368.7624 373.4017 413.5571 433.7652 440.8806 452.0805 488.4919 518.1214 556.6193 565.4087 590.0369 659.5339 664.0122 687.6973 697.9955 724.3024 755.6001 781.2796 828.6197 840.2890 870.1854 898.5201 928.8321 938.6293 942.4627 960.9514 984.0877 1015.2288 1039.7679 1058.8180 1093.3169 1111.3882 1130.5737 1137.8105 1155.5264 1164.8842 1179.7574 1204.0839 1234.0253 1279.8253 1320.9300 1337.0070 1347.6144 1384.4992 1384.9349 1399.4206 1403.2807 1417.1246 1421.1464 1452.2412 1453.4229 1456.3738 1461.2245 1466.8706 1467.8453 1468.3923 1474.1117 1482.7273 1580.1104 1606.2673 2988.0257 2990.9518 2992.7797 2997.1476 2997.4765 3084.6853 3088.1541 3094.5326 3096.5362 3097.9765 3101.6083 3107.6985 3136.8518 3161.1137 3173.7028 3192.3867
redmass: 3.6471 3.1696 6.4782 4.8228 3.9322 4.4693 3.1030 6.8863 1.3932 5.3976 3.6646 4.6715 1.1475 3.1581 1.7383 2.3149 1.5623 2.1653 5.7470 5.2500 3.5446 6.5468 4.6712 5.1128 3.3067 6.6398 3.0888 3.1553 5.9491 5.6768 5.9739 5.4465 4.6348 6.2790 6.7139 4.5149 7.3033 7.3055 5.1094 8.2810 9.7472 6.2710 1.3699 1.5300 2.9781 1.2264 1.3652 3.7971 8.2799 1.3241 1.5854 1.5526 4.3088 1.6328 1.2457 1.2997 1.5928 2.0882 1.6795 1.9486 9.1250 4.2044 1.4553 1.1977 1.4558 6.1817 1.3077 2.8464 1.2140 2.0164 2.2873 1.1373 1.0462 1.0485 1.0499 1.0486 1.8872 1.0642 1.0521 1.4815 1.0514 7.7815 6.7347 1.0301 1.0436 1.0738 1.0396 1.0364 1.0961 1.0992 1.1048 1.0995 1.1014 1.1009 1.1005 1.1036 1.0918 1.0886 1.0972
irintensity: 0.4666 0.1242 0.0605 0.0278 2.3929 1.9916 3.1548 4.4577 0.5265 2.4267 3.0282 1.3921 0.8576 3.3582 1.6740 8.3815 3.2975 1.8593 9.3623 7.9650 0.2356 5.0777 10.4846 7.3093 2.8527 0.6723 8.9062 2.1334 22.8508 11.1430 12.3900 40.0254 5.5222 12.9757 132.2825 49.7637 67.5348 112.1713 2.6176 136.0527 56.9650 245.0941 19.7693 35.1207 101.5382 1.6819 4.7396 213.1152 112.5797 0.3911 15.7819 8.2364 30.0332 93.3280 0.7857 1.1541 36.7138 17.2981 106.4631 18.0572 558.8136 66.8509 9.4325 17.6692 6.6471 105.3279 42.9717 16.8874 25.5611 33.3782 33.1680 6.2674 10.1751 4.9198 14.2889 3.2079 14.4233 20.6768 13.6090 64.3732 13.2973 87.1412 186.0759 43.8131 12.1199 8.8392 16.2992 10.2364 5.3386 16.3574 19.3259 26.9625 24.0574 16.3889 32.5687 12.2947 5.5651 0.9217 3.9613
temp: 298.150 k
press: 1.00000 atm
elementType: 16 15 8 8 8 8 8 7 6 6 6 6 6 6 6 6 6 6 6 1 1 1 1 1 1 1 1 1 1 1 1 1 1 1 1
symmnumber: 1
zpe: 686759.7 jmol-1
zpe.correction: 0.261573 hartree
zpe.thermalcorrener: 0.282909 hartree
zpe.thermalcorrenthalpy: 0.283853 hartree
zpe.thermalcorrgfe: 0.207523 hartree
zpe.sumelectzpe: -1597.389739 hartree
zpe.sumelectthermal: -1597.368403 hartree
zpe.sumelectthermalent: -1597.367459 hartree
zpe.sumelectthermalfe: -1597.443790 hartree
dipole: 7.0348 0.1418 -0.4963
dipole: 7.0537
quadrupole: -152.2671 -108.3243 -134.5213
quadrupole: 2.5339 0.3601 0.9974
quadrupole: -20.5628 23.3800 -2.8171 2.5339 0.3601 0.9974
hfenergy: -1597.6513122 hartree
pointgroup: C01 [X(C11H16N1O5P1S1)]
dipole: 2.7721687 -0.0658173 -0.110259 debye
polarizability: 267.6872875|-9.1935583|193.0654178|5.3701872|14.8496067|140.7216382 unknown
InChI: InChI=1S/C11H16NO5PS/c1-8(2)16-18(19,15-4)17-10-5-6-11(12(13)14)9(3)7-10/h5-8H,1-4H3
charge 0 multiplicity 1
35 atoms
S  2.210316 -0.546531 2.371585
P  2.336568 -0.714698 0.323852
O  2.626816 0.694128 -0.60457
O  0.937122 -1.339515 -0.535575
O  3.490372 -1.810859 -0.327944
O  -5.339552 -0.636212 -0.449581
O  -4.846021 1.4284 0.363835
N  -4.488083 0.265222 -0.07619
C  3.597823 1.742192 -0.093766
C  -0.37825 -0.869904 -0.373439
C  -2.028992 0.872402 0.205361
C  5.03734 1.246338 -0.271404
C  3.259417 2.986741 -0.915901
C  -0.688706 0.430703 0.079071
C  -3.046946 -0.06238 -0.160099
C  -1.400695 -1.77957 -0.73184
C  -2.733465 -1.365015 -0.626774
C  -2.268941 2.283601 0.704037
C  3.566904 -3.176003 0.250689
H  3.367889 1.899977 0.979731
H  5.743442 2.027156 0.065843
H  5.226616 0.332744 0.318523
H  5.238393 1.021233 -1.332791
H  3.901687 3.827832 -0.597835
H  2.204675 3.278116 -0.77707
H  3.43305 2.798924 -1.989292
H  0.118757 1.124846 0.329149
H  -1.135342 -2.780173 -1.082105
H  -3.556079 -2.033101 -0.892429
H  -1.305357 2.78518 0.8953
H  -2.848319 2.879204 -0.021883
H  -2.865137 2.288211 1.632484
H  4.473884 -3.611135 -0.193071
H  2.67708 -3.760333 -0.039213
H  3.658235 -3.129921 1.351313
