program: Gaussian 09
title: 000201163
version: EM64L-G09RevD.01
frameworkgroup: C1[X(C20H22N2O4)]
method: RPBEPBE
basis: SDD
operation: Freq
keyword: #p
keyword: freq=noraman
keyword: PBEPBE/SDD
title: #p freq=noraman PBEPBE/SDD
converged: YES YES NO NO
title: Mulliken charges:
elementType: O O O O N N C C C C C C C C C C C C C C C C C C C C H H H H H H H H H H H H H H H H H H H H H H
charge: -0.229817 -0.237333 -0.335672 -0.223043 -0.389013 -0.289844 0.005180 -0.494018 -0.212751 -0.721312 -0.711720 0.233022 0.233869 0.267066 -0.368813 -0.338619 -0.231334 -0.222434 -0.223155 0.185949 0.237137 -0.341237 -0.319871 -0.216313 -0.215976 -0.219059 0.234628 0.225482 0.185601 0.297301 0.209860 0.215052 0.229624 0.211287 0.215310 0.215115 0.320553 0.376232 0.223796 0.271340 0.231522 0.234179 0.234176 0.267762 0.277575 0.234790 0.234085 0.233840
chargesum: 0.00000
title: Mulliken charges with hydrogens summed into heavy atoms:
elementType: O O O O N N C C C C C C C C C C C C C C C C C C C C
charge: -0.229817 -0.237333 -0.335672 -0.223043 -0.068459 0.086388 0.190781 -0.033909 0.084550 -0.066776 -0.070008 0.233022 0.233869 0.267066 -0.145017 -0.067279 0.000188 0.011745 0.011022 0.185949 0.237137 -0.073475 -0.042296 0.018477 0.018110 0.014781
polarizability: 3.02370819e+02 -6.62224403e+00 2.70301376e+02 1.99651565e+01 -1.47749894e+01 1.72655499e+02
1716.lowfreq: -5.7899 -2.6266 -0.0010 -0.0009 -0.0008 4.6480 14.7510 23.9470 24.3407
frequency: 14.7469 23.8916 24.2606 33.6988 37.2158 46.7119 55.7726 68.0405 78.3867 87.3802 109.0096 114.2243 151.7325 167.2837 181.8852 206.2337 225.7525 238.9127 242.8708 265.1886 278.9823 293.9763 308.0313 334.5628 372.1094 394.0344 400.8975 404.0334 409.9259 419.0148 428.2929 438.5980 459.7264 502.5410 530.2326 571.1544 613.3072 614.4083 644.6058 662.6487 666.3588 677.3641 686.9545 696.9417 701.0867 745.2120 753.9254 787.9643 791.4868 792.5848 820.5717 845.4807 852.0544 855.9632 863.5323 914.1736 934.8529 937.6315 946.4736 953.3993 954.3960 958.9146 972.4318 984.1163 989.9525 990.6473 995.1590 1005.3737 1008.0336 1009.0654 1026.1701 1028.3295 1082.2107 1086.3189 1088.9342 1127.1115 1132.2442 1156.4187 1169.7327 1174.8029 1175.2523 1183.1136 1185.8326 1189.4277 1225.8141 1228.4604 1269.1968 1280.2209 1302.2127 1316.7176 1318.7889 1331.0238 1335.2350 1352.5459 1380.0190 1386.2110 1390.0770 1398.4143 1431.2726 1439.1383 1452.8028 1455.8119 1467.4249 1469.7738 1473.7759 1477.8284 1484.3631 1489.8199 1492.5358 1549.9214 1587.5627 1595.9668 1611.2420 1612.2137 1643.7386 1670.4271 2952.9969 2969.7167 2973.3679 2989.6379 3024.0012 3050.1742 3062.8556 3068.7295 3071.2535 3073.9283 3120.7150 3131.8873 3134.2807 3141.6562 3144.8482 3147.9519 3156.9128 3161.6708 3168.5228 3173.3904 3182.8527 3543.1405
redmass: 6.2329 5.4919 4.4686 3.6355 3.3175 3.4421 6.4346 6.2007 8.3883 4.7737 4.2361 5.1759 5.5477 4.7034 4.2264 2.0110 1.5096 1.5208 4.3404 3.0645 2.9218 7.9754 5.6594 6.0584 3.5831 4.3798 2.8151 2.8570 3.9002 2.5476 3.4675 3.9726 6.3751 4.3384 3.1694 1.3131 6.4434 6.2437 5.3606 4.5707 5.6499 4.8354 5.4082 1.6836 1.5702 2.6540 5.4559 2.9279 2.4013 2.3527 3.0833 1.6831 4.2018 1.2679 1.2459 1.1923 2.2695 1.9276 2.8427 1.9219 1.5137 1.6494 3.4743 1.4489 5.3477 5.7558 1.3905 1.3618 2.3061 1.4627 2.2215 2.0869 1.7641 1.5693 2.2993 2.5081 2.4741 2.6552 2.2204 1.0596 1.0576 1.8788 1.1577 1.1285 1.7403 3.1068 1.3815 1.6470 1.3966 1.3234 1.3077 1.4674 1.3434 1.6167 1.2126 9.1483 9.9878 1.2161 2.2440 2.2505 1.4741 1.3146 1.2978 1.1388 1.1341 2.2544 1.0570 1.2275 1.8328 4.5577 6.3229 6.2740 6.0171 6.0595 8.7617 10.9099 1.0829 1.0354 1.0362 1.0614 1.0850 1.0993 1.0995 1.0996 1.0990 1.0988 1.0873 1.0857 1.0873 1.0899 1.0893 1.0923 1.0941 1.0964 1.0986 1.0998 1.0974 1.0776
irintensity: 0.6308 1.7366 0.6524 0.1639 0.2655 0.7553 0.2814 0.9778 1.6016 1.0892 4.1548 3.7797 7.3094 9.9406 5.5517 8.1109 2.2369 1.8148 2.1992 3.9123 4.6699 5.2728 8.1675 12.8760 6.5642 1.2573 0.0147 0.1406 5.3556 3.2109 9.2600 3.0930 3.5195 8.2511 10.3112 104.5235 1.3824 0.6332 7.6662 31.2842 21.3905 20.7590 16.0696 69.5784 90.4536 67.6835 104.3724 77.2602 25.2343 11.0284 12.5612 3.1370 15.1356 0.2353 0.0748 4.3661 45.0465 18.7928 14.8668 39.8128 19.3981 14.0699 154.7374 1.5164 0.8810 1.1789 0.0385 3.8515 36.8148 7.7622 8.7788 2.3279 10.8471 10.0514 4.3948 3.5867 6.7983 6.1789 1.3468 0.6787 0.4882 24.9984 35.6222 6.9717 99.1383 114.8767 6.9072 58.2936 2.4885 0.0201 1.5226 37.4146 5.7674 4.3032 18.7018 2.7621 4.1434 18.0206 10.8355 17.3944 147.1383 178.4296 82.7410 16.2738 13.5156 1.7263 6.1458 60.9787 66.1730 77.7895 10.6796 9.4021 19.7393 10.6318 268.5059 151.5862 32.1830 37.8413 24.9391 13.3133 2.2290 13.8887 12.3243 33.5399 63.4629 77.0384 7.3584 0.1527 1.3154 498.5631 9.1017 22.3822 15.6275 16.3026 19.8724 12.8954 6.0375 19.8611
temp: 298.150 k
press: 1.00000 atm
elementType: 8 8 8 8 7 7 6 6 6 6 6 6 6 6 6 6 6 6 6 6 6 6 6 6 6 6 1 1 1 1 1 1 1 1 1 1 1 1 1 1 1 1 1 1 1 1 1 1
symmnumber: 1
zpe: 1003172.4 jmol-1
zpe.correction: 0.382088 hartree
zpe.thermalcorrener: 0.407181 hartree
zpe.thermalcorrenthalpy: 0.408125 hartree
zpe.thermalcorrgfe: 0.323205 hartree
zpe.sumelectzpe: -1183.829487 hartree
zpe.sumelectthermal: -1183.804395 hartree
zpe.sumelectthermalent: -1183.803451 hartree
zpe.sumelectthermalfe: -1183.888371 hartree
dipole: -1.3600 2.2336 -1.1582
dipole: 2.8601
quadrupole: -115.5640 -141.3266 -157.9378
quadrupole: 2.4816 8.3924 -8.3344
quadrupole: 22.7121 -3.0504 -19.6617 2.4816 8.3924 -8.3344
hfenergy: -1184.2115757 hartree
pointgroup: C01 [X(C20H22N2O4)]
dipole: -0.8148946 0.7395694 -0.2348894 debye
polarizability: 307.1048827|1.039401|269.32165|6.917451|8.6419303|168.9011619 unknown
InChI: InChI=1S/C20H22N2O4/c1-14(2)13-17(21-18(23)15-9-5-3-6-10-15)19(24)22-26-20(25)16-11-7-4-8-12-16/h3-12,14,17,21-22H,13H2,1-2H3
charge 0 multiplicity 1
48 atoms
O  1.1485 -2.106392 -1.406527
O  2.493969 -0.64962 0.606737
O  -1.037753 -0.217494 2.028523
O  1.383855 1.156301 -0.433109
N  -1.728309 -0.998485 -0.043004
N  1.188893 -1.237025 0.781759
C  -2.872571 -3.767343 -0.676728
C  -1.411823 -3.308976 -0.927537
C  -0.895942 -2.2204 0.030605
C  -3.065967 -4.360091 0.739614
C  -3.286659 -4.791499 -1.760171
C  0.590635 -1.858836 -0.305243
C  -1.774304 -0.078175 0.984645
C  -2.710286 1.081487 0.832864
C  -3.85097 1.04364 -0.012267
C  -2.440359 2.250647 1.588815
C  -4.697291 2.168818 -0.112382
C  -3.285312 3.37412 1.485373
C  -4.41344 3.3380 0.631529
C  2.454358 0.605488 -0.114367
C  3.8325 1.103367 -0.356079
C  3.975384 2.394478 -0.930348
C  4.982622 0.332965 -0.03955
C  5.260975 2.913482 -1.18209
C  6.266104 0.858769 -0.295148
C  6.408042 2.147034 -0.863986
H  -1.292682 -2.951604 -1.969462
H  -0.735686 -4.180659 -0.834804
H  -3.541365 -2.884428 -0.767898
H  -0.934712 -2.565776 1.07953
H  -2.380894 -5.214725 0.901926
H  -4.100078 -4.728189 0.871304
H  -2.877127 -3.614505 1.533312
H  -2.656881 -5.699954 -1.700438
H  -4.339717 -5.102821 -1.631675
H  -3.175629 -4.372234 -2.777789
H  -2.143016 -0.764337 -0.947264
H  0.592354 -0.815333 1.532997
H  -4.108267 0.130672 -0.563049
H  -1.566074 2.253166 2.247136
H  -5.580465 2.131267 -0.759234
H  -3.066772 4.27643 2.066458
H  -5.071012 4.210718 0.552036
H  3.073815 2.966974 -1.172268
H  4.860145 -0.663869 0.391926
H  5.371385 3.908963 -1.625068
H  7.154722 0.265482 -0.054892
H  7.407506 2.5507 -1.061211
