program: Gaussian 09
title: 000201093
version: EM64L-G09RevD.01
frameworkgroup: C1[X(C13H21N6OP)]
method: RPBEPBE
basis: SDD
operation: Freq
keyword: #p
keyword: freq=noraman
keyword: PBEPBE/SDD
title: #p freq=noraman PBEPBE/SDD
converged: YES YES NO NO
title: Mulliken charges:
elementType: P O N N N N N N C C C C C C C C C C C C C H H H H H H H H H H H H H H H H H H H H H
charge: 1.238556 -0.601340 -0.392556 -0.442432 -0.763672 -0.136735 -0.179780 -0.065231 -0.408317 -0.399404 -0.414778 -0.366594 0.082840 -0.385659 -0.415123 -0.372884 -0.377770 -0.402845 0.331727 -0.312288 -0.285786 0.273074 0.242275 0.245305 0.285942 0.277816 0.250150 0.247711 0.245562 0.384068 0.212156 0.208533 0.297501 0.196043 0.200808 0.211738 0.217858 0.205227 0.223985 0.189020 0.218383 0.236915
chargesum: 0.00000
title: Mulliken charges with hydrogens summed into heavy atoms:
elementType: P O N N N N N N C C C C C C C C C C C C C
charge: 1.238556 -0.601340 -0.392556 -0.442432 -0.379604 -0.136735 -0.179780 -0.065231 0.107032 0.131843 0.113189 0.126679 0.082840 0.035030 0.078421 0.039662 0.045315 0.010160 0.331727 -0.093905 -0.048871
polarizability: 2.67613440e+02 -3.93804068e+00 2.15686994e+02 8.41081363e+00 -4.72673400e+00 1.54207612e+02
1716.lowfreq: -16.6021 -11.8964 -7.7133 -0.0017 -0.0011 0.0007 4.9691 17.0148 33.9837
frequency: -13.4284 14.1804 33.8171 37.3273 42.9953 57.5746 72.4540 115.7263 126.9644 147.4794 154.6311 166.2814 189.8239 204.9188 242.4536 258.6489 260.0818 302.9226 323.2614 334.9524 343.4133 378.7563 385.4645 427.0616 451.9290 455.2572 482.3717 487.9044 537.7658 578.9800 584.4881 629.8024 648.6984 682.0775 690.4791 766.9683 784.1045 791.8285 793.5294 796.2662 803.7185 807.2605 816.3686 831.3312 847.2728 877.3047 888.7060 899.2771 902.4043 931.3869 947.5770 956.3318 994.8651 996.3621 998.7592 1005.8661 1032.5958 1055.0265 1075.0802 1081.5279 1087.3532 1097.5384 1112.3636 1114.1467 1120.2841 1122.2180 1124.9701 1144.3220 1151.8763 1155.6162 1158.0339 1219.2883 1230.4217 1235.7830 1241.6545 1253.8900 1270.6089 1275.2258 1284.9815 1327.1619 1337.6013 1345.0173 1345.5162 1353.0652 1369.5749 1388.7518 1449.4016 1452.0242 1453.6063 1453.9725 1460.0627 1463.2627 1466.8319 1468.7538 1470.2283 1477.4616 1483.7612 1534.7194 1573.2310 2941.5286 2945.2359 2967.4505 2986.2691 2992.5966 3038.4023 3048.8650 3058.3940 3073.1086 3076.2951 3079.1648 3082.5537 3091.1662 3097.9535 3137.3856 3180.1615 3183.4260 3191.5355 3196.4053 3201.1896 3553.1589
redmass: 3.2148 3.8808 4.0400 3.5539 4.1886 3.8153 4.0265 3.7484 3.5198 4.3319 3.4665 5.1309 5.0712 5.7556 2.8534 2.5386 3.5949 4.8326 4.0807 5.0296 4.6296 5.3273 1.8051 2.9084 3.7596 4.3836 3.4929 2.6717 7.3406 3.2980 3.2528 1.7093 3.8685 3.9084 4.9825 2.2703 6.9780 4.1345 2.9318 4.9519 1.5241 1.2647 1.1703 3.0640 1.4433 4.0393 4.5713 3.5529 2.6486 7.0138 1.3311 1.3803 1.3730 1.4980 1.2296 9.7730 2.5114 2.1133 1.2681 1.2695 1.6699 1.6544 1.3303 1.3166 1.3436 1.2923 2.5091 1.9170 1.3962 1.3325 1.3880 1.6566 1.9251 3.2285 3.2460 1.3103 1.4423 1.2411 4.1570 1.2595 1.3689 1.5027 1.4499 1.3638 1.5853 2.4490 2.5952 1.1109 1.0908 1.2878 2.4478 1.0894 1.1834 1.2803 1.1863 1.1197 1.1304 5.9630 6.0523 1.0701 1.0713 1.0642 1.0606 1.0615 1.0960 1.1029 1.1031 1.0488 1.0488 1.0600 1.0612 1.0932 1.0902 1.0910 1.1187 1.1178 1.0941 1.1177 1.1175 1.0760
irintensity: 2.2266 0.5317 0.1052 1.2352 2.7388 0.8510 0.8146 2.5378 2.6487 6.6193 0.6479 3.2404 21.7614 12.5415 1.3516 1.4509 5.4773 0.1590 2.7096 4.3166 2.0303 6.4013 2.8860 2.5695 10.8743 19.7500 0.4834 5.0610 101.8223 21.7872 23.5448 58.9168 75.9197 21.8805 6.5303 1.9111 25.8841 14.4358 48.9161 38.8428 4.7321 13.7035 32.6280 38.9118 17.6693 100.0390 220.3769 31.6075 5.9169 30.7913 4.1937 1.5500 19.8756 22.7035 8.9588 54.5770 3.3543 17.8885 3.0795 10.3667 4.8707 3.8092 4.1042 7.7647 2.4780 17.5711 19.8064 0.7865 0.0411 0.2963 0.4106 11.6862 70.4402 54.6694 35.9813 14.3476 112.4680 15.9234 16.9419 4.2308 4.1344 11.1528 1.5215 9.4857 5.9520 15.5753 377.1594 12.3347 18.4443 231.3183 222.3320 20.7012 10.4632 43.8644 26.0043 2.2314 20.0815 344.6484 631.2470 18.7301 95.0335 45.8375 34.2815 23.7448 63.7066 36.8513 73.5130 8.5077 15.6269 38.8190 31.0259 6.2369 19.5716 23.8124 5.9569 2.8205 17.5020 8.2243 13.2367 88.9607
temp: 298.150 k
press: 1.00000 atm
elementType: 15 8 7 7 7 7 7 7 6 6 6 6 6 6 6 6 6 6 6 6 6 1 1 1 1 1 1 1 1 1 1 1 1 1 1 1 1 1 1 1 1 1
symmnumber: 1
zpe: 895581.2 jmol-1
zpe.correction: 0.341109 hartree
zpe.thermalcorrener: 0.361335 hartree
zpe.thermalcorrenthalpy: 0.362279 hartree
zpe.thermalcorrgfe: 0.290113 hartree
zpe.sumelectzpe: -1251.248294 hartree
zpe.sumelectthermal: -1251.228068 hartree
zpe.sumelectthermalent: -1251.227124 hartree
zpe.sumelectthermalfe: -1251.299290 hartree
dipole: 3.2179 -2.0875 1.0525
dipole: 3.9774
quadrupole: -106.5001 -132.4245 -132.0346
quadrupole: 4.9713 4.6347 -5.0051
quadrupole: 17.1530 -8.7714 -8.3816 4.9713 4.6347 -5.0051
hfenergy: -1251.589403 hartree
pointgroup: C01 [X(C13H21N6O1P1)]
dipole: 1.2756408 -0.8599663 0.2862509 debye
polarizability: 267.3507638|-4.6200833|215.0944918|10.2675116|6.8894802|155.0627901 unknown
InChI: InChI=1S/C13H21N6OP/c20-21(18-8-9-18,19-10-11-19)16-13-14-5-4-12(15-13)17-6-2-1-3-7-17/h4-5,16H,1-3,6-11H2
charge 0 multiplicity 1
42 atoms
P  -2.412803 -0.309083 -0.193478
O  -1.667943 -1.095651 -1.380786
N  -2.649225 -1.241194 1.322164
N  -4.086841 0.229017 -0.539563
N  -1.833233 1.277203 0.272783
N  2.636079 -0.106594 0.366113
N  0.406728 0.617717 0.412422
N  -0.24639 2.961401 0.661665
C  -2.071233 -2.646823 1.361372
C  -1.444691 -1.547772 2.197236
C  -4.550424 0.129286 -1.985165
C  -5.099374 -0.822017 -0.939068
C  -0.499038 1.629615 0.455613
C  4.093116 0.020301 0.565718
C  2.178004 -1.468785 -0.005576
C  4.874331 -0.452069 -0.68421
C  2.929311 -1.977991 -1.2574
C  4.461718 -1.891298 -1.071443
C  1.740684 0.936312 0.511921
C  2.117253 2.303763 0.750152
C  1.083841 3.25144 0.823242
H  -1.526124 -2.984215 0.470626
H  -2.733823 -3.382283 1.828184
H  -1.660107 -1.48971 3.268649
H  -0.473727 -1.152466 1.877263
H  -3.835208 -0.276949 -2.711347
H  -5.147899 0.983135 -2.317118
H  -6.09427 -0.661773 -0.513593
H  -4.773654 -1.868273 -0.991448
H  -2.527576 2.024069 0.358968
H  4.386794 -0.610064 1.433587
H  4.355014 1.05918 0.815239
H  1.094073 -1.421858 -0.190044
H  2.367183 -2.155051 0.848752
H  5.959783 -0.398309 -0.473205
H  4.663082 0.23614 -1.525695
H  2.621146 -1.369756 -2.129387
H  2.617376 -3.020182 -1.459536
H  4.983596 -2.205915 -1.994446
H  4.776897 -2.590927 -0.268917
H  3.153048 2.626434 0.859244
H  1.316624 4.306391 1.006814
