program: Gaussian 09
title: 000201037
version: EM64L-G09RevD.01
frameworkgroup: C1[X(C8H11O2P)]
method: RPBEPBE
basis: SDD
operation: Freq
keyword: #p
keyword: freq=noraman
keyword: PBEPBE/SDD
title: #p freq=noraman PBEPBE/SDD
converged: YES YES NO NO
title: Mulliken charges:
elementType: P O O C C C C C C C C H H H H H H H H H H H
charge: 0.619137 -0.452023 -0.469867 -0.190979 -0.598948 -0.566979 -0.277290 -0.267687 -0.229220 -0.234275 -0.235484 0.257247 0.273928 0.227801 0.242263 0.225553 0.291145 0.226694 0.229010 0.229295 0.346341 0.354337
chargesum: 0.00000
title: Mulliken charges with hydrogens summed into heavy atoms:
elementType: P O O C C C C C C C C
charge: 0.619137 -0.105682 -0.115531 -0.190979 -0.067773 -0.096915 -0.051737 0.023458 -0.002526 -0.005265 -0.006188
polarizability: 1.54887847e+02 -1.34785806e-01 1.22195167e+02 6.10083874e+00 4.00036089e+00 6.84508661e+01
1716.lowfreq: -11.4835 -1.7265 -0.0003 0.0012 0.0019 6.6303 33.5630 63.5442 83.9762
frequency: 33.5123 63.5306 83.9520 95.9210 140.8880 166.9485 191.7823 229.2984 259.5202 294.2183 338.0663 373.8637 396.4594 411.2413 489.2836 612.1771 633.6105 664.2112 676.0552 703.7293 750.0276 854.7008 871.9697 896.1177 921.3410 955.6412 965.8308 978.1283 985.7440 997.6229 1020.9292 1078.1165 1083.6264 1130.4399 1163.8732 1173.6878 1177.9888 1198.8570 1274.8715 1315.0808 1321.2351 1339.2343 1369.4006 1423.0445 1444.0864 1452.1107 1469.1997 1579.5961 1595.5648 2951.4551 2995.8834 3019.8943 3089.6441 3112.7953 3121.9870 3133.2379 3143.3206 3161.2431 3559.8247 3566.7901
redmass: 3.6992 4.4144 5.0425 4.7996 2.8309 2.8462 1.1146 4.2564 4.1894 4.0144 1.6436 3.3885 2.8185 5.2766 3.4249 6.3973 4.7896 5.1242 6.1605 1.9584 1.6527 1.2518 1.3859 1.4376 1.3767 8.1127 6.6791 1.3907 6.0518 1.3213 3.2723 1.8141 2.2675 1.0630 1.0683 1.0545 1.0738 1.1314 1.1760 1.3564 1.3359 1.2176 5.2597 2.1601 1.0726 1.0741 1.9727 5.7095 5.7537 1.0536 1.0593 1.1080 1.1042 1.0866 1.0868 1.0917 1.0962 1.1015 1.0661 1.0667
irintensity: 1.4533 9.4978 4.9695 5.8243 20.7419 6.8763 134.4902 3.3348 3.1392 8.2491 149.7759 75.7671 4.0297 8.8248 18.3566 0.1869 1.9629 16.8463 0.7544 47.2785 59.2075 0.7328 35.0017 4.4999 3.8357 93.3405 98.3812 1.5974 4.3206 0.2482 5.8969 3.2264 1.7501 27.9784 17.2669 1.4014 22.6836 0.9971 3.5211 15.0470 9.9325 27.5772 0.4106 9.1451 8.2015 4.7129 22.0019 0.9133 12.0538 42.0907 24.8137 36.8706 13.9641 7.3162 0.8372 7.9154 29.2717 34.4150 9.0809 4.1558
temp: 298.150 k
press: 1.00000 atm
elementType: 15 8 8 6 6 6 6 6 6 6 6 1 1 1 1 1 1 1 1 1 1 1
symmnumber: 1
zpe: 451604.7 jmol-1
zpe.correction: 0.172007 hartree
zpe.thermalcorrener: 0.184291 hartree
zpe.thermalcorrenthalpy: 0.185235 hartree
zpe.thermalcorrgfe: 0.132609 hartree
zpe.sumelectzpe: -802.252640 hartree
zpe.sumelectthermal: -802.240356 hartree
zpe.sumelectthermalent: -802.239412 hartree
zpe.sumelectthermalfe: -802.292038 hartree
dipole: -0.0128 -2.5906 1.3602
dipole: 2.9261
quadrupole: -66.8451 -66.7598 -75.1709
quadrupole: 3.3233 -1.4377 -4.3749
quadrupole: 2.7469 2.8321 -5.5790 3.3233 -1.4377 -4.3749
hfenergy: -802.4246469 hartree
pointgroup: C01 [X(C8H11O2P1)]
dipole: 0.130875 -0.6061301 -0.969917 debye
dipolederiv: 0.2593286 -0.0715286 -0.0335949 -0.0050083 0.0916451 -0.1405035 -0.0853462 -0.0550377 0.3004324 -0.4751562 -0.1910734 0.0426122 -0.2464863 -0.6332054 -0.4102285 -0.0042442 -0.3920208 -0.5678538 -0.9753404 0.1469537 0.0267398 0.118742 -0.4953377 0.1513489 0.0319763 0.1810931 -0.1943777 0.3530289 -0.0408386 0.1670456 -0.028789 -0.1562206 -0.0151047 0.0552125 0.0016624 -0.1688938 0.1716552 0.1229966 0.0018947 0.138885 0.4392339 0.2802719 0.1808231 0.3983695 0.4065242 0.654263 -0.1798658 -0.1087494 -0.2283798 0.2589379 -0.0106616 -0.0855434 -0.1027304 0.0436492 -0.2364099 -0.0837181 -0.0359881 -0.0050542 0.0591465 0.0389739 -0.058151 0.0247159 -0.1483737 -0.2882441 0.0755818 0.0007056 0.0612577 -0.0288786 0.0676108 -0.0025266 0.0730957 -0.0858773 0.0072886 0.0513748 0.0855027 0.0250951 0.0534162 0.0720357 0.0810502 0.0734376 -0.0889349 0.0098545 -0.0978897 0.0301025 -0.0657787 0.0992917 0.053691 0.0560606 0.0465169 -0.1025127 0.0129302 -0.0328307 0.0768332 -0.0324003 -0.0842315 0.0149779 0.0581598 0.018786 -0.1318768 0.0860368 0.0307897 -0.0479001 -0.0127665 -0.0595011 0.0584078 -0.0370674 0.041272 -0.0792728 -0.1437821 -0.0199425 0.033953 -0.0319506 0.0338346 -0.0544896 0.0166718 -0.0276124 0.0407715 -0.0468006 -0.0582347 -0.0167961 -0.0859123 -0.1234225 -0.0604947 -0.0283433 -0.0694032 0.0347599 -0.0571426 0.0512778 0.0021613 0.0453542 -0.0182724 0.1009375 -0.0055717 0.0618484 -0.1635774 0.0639514 0.1146433 -0.0061848 0.0871324 -0.0625311 -0.0331083 -0.0106706 -0.0181813 0.1231746 0.1151426 -0.0452037 -0.0339739 -0.032379 0.041623 -0.0384567 -0.0310374 -0.0492556 0.1079192 0.0116795 -0.0694722 -0.0718333 -0.0858321 -0.0300635 -0.091864 -0.0837849 -0.0893589 0.0989939 0.024508 0.0865964 -0.0150826 0.1113731 -0.075067 -0.0397651 -0.0159639 -0.0458001 0.1354653 -0.1074728 0.0376727 -0.0898846 0.0408557 0.0913951 -0.0078954 -0.0976617 -0.0086252 0.1208679 0.3120221 0.1451061 -0.0345907 0.1793135 0.2770619 0.1996947 -0.0415024 0.0999555 0.1927887 0.2486592 0.0276052 0.0270278 0.0527288 0.3211454 -0.135378 0.1074604 -0.1627274 0.1262042 unknown
polarizability: 150.4220402|-8.6084559|112.2945139|18.1732862|20.1196726|82.8173259 unknown
InChI: InChI=1S/C8H11O2P/c9-6-11(7-10)8-4-2-1-3-5-8/h1-5,9-10H,6-7H2
charge 0 multiplicity 1
22 atoms
P  1.229873 -0.567342 0.787545
O  1.666667 2.049394 1.768327
O  3.470119 -1.340108 -0.521461
C  -0.502056 -0.242326 0.102074
C  2.000278 1.192269 0.629051
C  2.032287 -1.276667 -0.809929
C  -1.229552 -1.294065 -0.51615
C  -1.133141 1.017639 0.280476
C  -2.548382 -1.082021 -0.977695
C  -2.454757 1.224158 -0.17746
C  -3.165521 0.179524 -0.812032
H  1.598925 1.713164 -0.255568
H  3.091085 1.044986 0.510125
H  1.598393 -2.276973 -1.006888
H  1.810092 -0.610951 -1.669911
H  -0.779301 -2.287853 -0.632151
H  -0.598666 1.830728 0.78596
H  -3.093497 -1.901811 -1.459678
H  -2.929395 2.201438 -0.032226
H  -4.189665 0.343055 -1.16568
H  2.002988 1.632855 2.602131
H  3.945229 -1.787691 -1.265759
