program: Gaussian 09
title: 000201027
version: EM64L-G09RevD.01
frameworkgroup: C1[X(C12H24N2O)]
method: RPBEPBE
basis: SDD
operation: Freq
keyword: #p
keyword: freq=noraman
keyword: PBEPBE/SDD
title: #p freq=noraman PBEPBE/SDD
converged: YES YES NO NO
title: Mulliken charges:
elementType: O N N C C C C C C C C C C C C H H H H H H H H H H H H H H H H H H H H H H H H
charge: -0.290143 -0.139057 -0.236681 -0.126027 -0.399949 -0.409849 0.194341 -0.368972 -0.362424 -0.438147 -0.445936 -0.355563 -0.361759 -0.693379 -0.701435 0.180100 0.219528 0.194506 0.228503 0.185329 0.221309 0.213253 0.204454 0.265823 0.224250 0.216417 0.227435 0.225946 0.185491 0.208565 0.178088 0.227871 0.252610 0.217138 0.215808 0.207143 0.203116 0.213346 0.218949
chargesum: 0.00000
title: Mulliken charges with hydrogens summed into heavy atoms:
elementType: O N N C C C C C C C C C C C C
charge: -0.290143 -0.139057 0.015929 0.054073 0.014084 0.003983 0.194341 0.065589 0.107853 0.002520 0.007445 0.038494 0.044201 -0.053290 -0.066023
polarizability: 1.69689750e+02 6.09709380e-01 1.45975311e+02 -6.03306641e+00 5.21907807e+00 1.24417883e+02
1716.lowfreq: -15.0356 -9.0175 -0.0006 0.0006 0.0007 10.0967 22.0737 37.8393 42.8712
frequency: 21.1033 37.4090 42.4347 58.4077 68.9702 71.1295 76.4286 138.6865 155.3721 186.1548 226.3941 232.9906 234.9366 263.2512 269.2718 293.6815 307.0703 350.9219 385.6938 411.4416 445.1924 471.9674 514.7779 556.5419 596.9204 664.1443 694.5961 709.9584 734.3366 763.9528 821.0186 834.6589 846.5015 884.0736 890.1257 900.1725 905.1490 934.9527 979.8235 998.3925 1006.9912 1021.0694 1035.5992 1049.2533 1070.6151 1078.6646 1105.0860 1113.8683 1122.2754 1126.9718 1156.4708 1178.4942 1181.8487 1205.9199 1222.3338 1235.5038 1255.4548 1264.6962 1282.1351 1292.2643 1300.1473 1307.0707 1307.9975 1318.4003 1331.9083 1335.5701 1344.4523 1351.9548 1352.6272 1357.0185 1386.6168 1389.7097 1409.3450 1441.2335 1443.1860 1447.4996 1448.0851 1457.9432 1461.1864 1466.5596 1470.8322 1473.7075 1477.2661 1477.5248 1484.0042 1486.5960 1568.5838 2939.6385 2949.8040 2961.1465 2962.2882 2967.0540 2970.7299 2972.9215 2973.7046 2983.1156 2983.8364 2996.2717 3010.4310 3020.6546 3035.7127 3051.4290 3056.9068 3065.7523 3067.9947 3070.9214 3072.4340 3073.9005 3079.4134 3091.4858 3429.8918
redmass: 3.2329 2.1974 3.0631 3.0065 2.1613 3.6565 2.0465 4.4188 2.7551 2.3517 1.5302 1.2670 1.3103 2.2926 2.8364 3.1706 2.7313 4.3537 1.9061 3.2481 2.8793 3.0425 2.9147 2.3999 2.0214 1.9896 4.5231 1.8377 1.1197 1.5586 1.6112 1.6747 1.7791 1.7079 2.1896 1.8347 1.5619 2.5935 2.3743 2.4022 1.6432 2.5202 2.6960 1.6603 2.6125 1.8428 1.8933 2.3466 2.8927 2.3770 2.1908 1.1300 3.3414 1.6164 1.4263 1.4054 1.4311 1.2918 1.2697 1.1566 1.1305 1.3496 1.3509 1.2714 1.2412 1.4068 1.2907 1.3857 1.4609 1.4106 1.2133 1.2122 2.5393 1.0731 1.1522 1.0995 1.0975 1.1036 1.1065 1.0755 1.0688 1.0650 1.0425 1.0423 1.0681 1.0773 7.3662 1.0702 1.0687 1.0612 1.0609 1.0644 1.0372 1.0781 1.0377 1.0620 1.0619 1.0614 1.0950 1.0943 1.1020 1.1016 1.1024 1.1025 1.0999 1.1004 1.1005 1.0996 1.0944 1.0909 1.0746
irintensity: 1.0943 0.4069 0.2153 1.4739 0.0651 1.3605 0.3017 2.0491 0.3931 0.2011 1.2377 0.3830 0.5734 9.0226 1.0170 4.8700 2.4007 13.9686 6.9684 1.7389 2.5502 1.9642 2.8882 2.6966 62.0867 175.1137 24.0532 6.1766 9.9216 7.1569 0.6647 0.7509 2.5737 4.9842 1.4066 6.3181 3.6108 2.8275 3.4636 8.3009 8.0420 44.9276 1.4530 7.3464 3.0066 0.6538 18.1466 18.8574 18.2581 10.4700 12.9552 10.8881 2.0522 112.2652 16.5776 26.6994 22.3957 10.5605 8.2651 1.6860 2.7986 1.0028 3.2423 0.3632 4.1113 2.8293 3.9954 4.6994 0.6968 6.4570 8.6218 12.0224 85.6388 2.7117 21.2052 19.7652 18.1572 8.3096 10.8253 0.3223 2.1990 3.5212 11.3811 13.3900 11.7866 13.0842 222.5537 39.5506 69.8333 7.9067 31.8717 45.3252 31.7239 50.2220 29.1249 20.8405 63.9567 44.3423 3.9992 5.5847 44.6714 6.6397 42.8201 49.0796 63.0472 83.2370 53.4386 60.3800 6.4532 28.4235 1.3697
temp: 298.150 k
press: 1.00000 atm
elementType: 8 7 7 6 6 6 6 6 6 6 6 6 6 6 6 1 1 1 1 1 1 1 1 1 1 1 1 1 1 1 1 1 1 1 1 1 1 1 1
symmnumber: 1
zpe: 914359.6 jmol-1
zpe.correction: 0.348261 hartree
zpe.thermalcorrener: 0.365857 hartree
zpe.thermalcorrenthalpy: 0.366801 hartree
zpe.thermalcorrgfe: 0.300848 hartree
zpe.sumelectzpe: -655.171490 hartree
zpe.sumelectthermal: -655.153894 hartree
zpe.sumelectthermalent: -655.152949 hartree
zpe.sumelectthermalfe: -655.218903 hartree
dipole: -1.1562 1.2416 3.3140
dipole: 3.7230
quadrupole: -94.4561 -96.1514 -95.2696
quadrupole: 8.4332 -2.9202 -3.1992
quadrupole: 0.8363 -0.8590 0.0228 8.4332 -2.9202 -3.1992
hfenergy: -655.5197509 hartree
pointgroup: C01 [X(C12H24N2O1)]
dipole: -0.4240099 0.5286711 1.2985401 debye
polarizability: 169.7340657|-1.9288396|146.065701|-4.6943789|5.8550674|124.2831772 unknown
InChI: InChI=1S/C12H24N2O/c1-3-5-11(6-4-2)12(15)14-9-7-13-8-10-14/h11,13H,3-10H2,1-2H3
charge 0 multiplicity 1
39 atoms
O  0.131968 -1.500064 -1.467069
N  -1.288656 -0.574704 0.118183
N  -3.958928 0.586455 0.288186
C  1.170731 0.018532 0.160458
C  1.225545 1.446464 -0.472668
C  2.479023 -0.77881 -0.067738
C  -0.023208 -0.749982 -0.448068
C  -1.634355 0.288477 1.267165
C  -2.445621 -1.301037 -0.460437
C  -2.784384 1.265719 0.877655
C  -3.572762 -0.30343 -0.835064
C  2.160265 2.431624 0.266648
C  2.561867 -2.082749 0.758166
C  2.16336 3.834071 -0.380099
C  3.890585 -2.83679 0.536712
H  1.029554 0.129644 1.25549
H  1.544698 1.347856 -1.52957
H  0.205759 1.883676 -0.497868
H  2.550258 -1.026779 -1.143587
H  3.344384 -0.135228 0.186804
H  -0.754644 0.860121 1.599736
H  -1.968652 -0.3491 2.115158
H  -2.82431 -2.029779 0.28854
H  -2.077221 -1.855444 -1.339397
H  -3.104647 1.837825 1.767666
H  -2.395639 1.987674 0.132624
H  -3.224634 0.331029 -1.672429
H  -4.465647 -0.855361 -1.180031
H  1.841536 2.51236 1.326898
H  3.193242 2.033783 0.281748
H  2.445723 -1.846247 1.836967
H  1.715488 -2.739361 0.478725
H  -4.509413 0.085577 1.000556
H  2.832434 4.527465 0.1616
H  2.506875 3.783793 -1.430313
H  1.148287 4.27474 -0.381549
H  4.757249 -2.209782 0.82149
H  3.934177 -3.765996 1.134332
H  4.011015 -3.113042 -0.527418
