program: Gaussian 09
title: 000201091
version: EM64L-G09RevD.01
frameworkgroup: C1[X(C23H30F3NO)]
method: RPBEPBE
basis: SDD
operation: Freq
keyword: #p
keyword: freq=noraman
keyword: PBEPBE/SDD
title: #p freq=noraman PBEPBE/SDD
converged: YES YES NO NO
title: Mulliken charges:
elementType: F F F O N C C C C C C C C C C C C C C C C C C C C C C C H H H H H H H H H H H H H H H H H H H H H H H H H H H H H H
charge: -0.158822 -0.153059 -0.175670 -0.294774 -0.081933 -0.415171 0.055614 -0.368660 -0.357960 -0.366268 -0.720723 -0.384238 -0.312032 0.379225 0.541205 0.099360 -0.692593 -0.704439 -0.359394 -0.363292 -0.420106 -0.358933 0.205042 -0.238958 -0.229122 -0.233551 -0.233575 -0.240410 0.186697 0.200805 0.180535 0.249411 0.180239 0.204938 0.169080 0.230855 0.220568 0.215130 0.237078 0.214899 0.217483 0.205758 0.176642 0.223816 0.219282 0.213884 0.230771 0.213703 0.208936 0.295405 0.245619 0.223890 0.266428 0.235946 0.238631 0.223291 0.225529 0.227986
chargesum: 0.00000
title: Mulliken charges with hydrogens summed into heavy atoms:
elementType: F F F O N C C C C C C C C C C C C C C C C C C C C C C C
charge: -0.158822 -0.153059 -0.175670 -0.294774 -0.081933 -0.027670 0.236149 0.060990 0.016058 -0.135413 -0.047947 0.048144 0.070369 0.379225 0.541205 0.099360 -0.035611 -0.051028 -0.063989 -0.117672 -0.196216 -0.092504 0.205042 -0.003012 0.009510 -0.010260 -0.008046 -0.012424
polarizability: 2.77679909e+02 2.94034798e+01 2.54752165e+02 -1.34249217e+01 -1.24268112e+01 2.38711290e+02
1716.lowfreq: 0.0003 0.0006 0.0007 1.9098 3.4352 4.4545 9.4991 15.1608 16.6371
frequency: 7.6964 15.1496 16.2653 23.5051 34.6640 42.0482 46.6953 53.7970 56.3076 73.1076 75.2785 82.3315 116.6924 122.3383 128.1510 146.8840 169.8272 188.1015 213.9501 220.1362 226.7621 234.9480 243.7585 253.9568 263.6628 268.7040 272.6559 290.1280 321.4434 341.3993 349.9810 385.7631 398.0901 401.8375 409.3402 432.2896 458.3986 467.3443 483.4911 508.7649 525.0163 529.6865 564.3221 568.6700 599.4669 608.4441 618.1254 640.5172 699.6737 710.7644 733.2706 744.3189 746.2238 761.0458 771.9438 775.1208 802.9155 808.5787 837.6058 847.1315 850.0199 862.3277 896.8262 902.5718 905.5861 926.6616 951.3042 953.7785 973.2873 974.6421 977.1926 989.2516 991.4860 991.8572 995.2669 1003.1587 1010.2732 1013.3932 1028.0977 1041.6143 1055.6240 1059.9948 1076.6848 1079.6177 1085.7689 1095.7217 1106.5280 1110.1475 1116.0986 1126.4163 1171.9530 1173.8874 1179.1469 1186.9949 1191.9845 1202.8886 1205.5107 1227.3634 1251.7165 1252.9798 1270.4760 1276.5717 1279.8374 1288.4694 1294.5369 1311.7492 1316.5428 1332.9873 1338.0883 1340.9796 1351.9761 1363.1414 1368.0979 1371.1387 1378.6788 1384.9828 1385.8232 1386.4713 1391.4477 1438.4771 1441.2985 1448.3805 1454.8560 1465.7020 1468.6595 1469.7409 1474.7129 1475.3056 1476.4514 1479.5420 1482.5511 1483.8346 1487.0987 1497.2047 1584.4233 1595.9724 1611.5515 1613.5569 2834.7106 2844.7283 2923.2205 2970.3661 2975.9629 2979.1402 2981.6176 2982.5810 2988.3931 2999.2835 3008.3022 3019.7720 3025.5240 3037.1887 3070.0240 3070.3144 3075.3902 3075.9420 3079.4188 3088.6542 3088.7579 3118.8520 3125.9690 3136.2717 3139.3437 3150.5055 3154.3313 3164.3199 3167.1341 3177.7793
redmass: 3.9192 4.8410 4.2655 3.6135 6.6616 7.3382 5.0044 2.9363 4.1995 3.0574 4.1744 3.4963 1.8460 4.8688 2.2745 5.9601 1.6314 4.2209 2.0633 1.8329 2.3941 2.6276 1.7496 4.1150 2.6162 2.4028 2.9114 1.8679 5.1326 4.9297 7.4983 2.7482 4.0148 2.7937 2.8667 6.4587 2.8011 3.8312 4.0781 3.1438 5.6877 2.7176 4.2182 4.0048 6.5143 9.1982 6.0918 5.3996 1.7841 4.7001 1.9585 1.8982 3.7018 1.7536 1.1393 1.3938 1.1603 2.4889 2.4546 2.4892 1.2555 2.3310 1.8968 1.5915 1.8263 1.6710 3.9248 5.5989 2.3456 1.5135 1.4392 1.9290 6.0748 4.8925 1.3464 1.3785 3.9910 5.2973 2.2583 2.5912 2.2638 2.2764 2.0610 2.1354 1.6173 2.1205 2.4660 2.2710 1.8095 1.6572 1.2900 1.5364 1.0829 2.1481 1.1148 2.1107 1.8471 1.7183 1.8208 1.5487 1.8638 1.1643 1.4886 1.3194 1.1860 1.3374 1.2208 1.3355 1.3267 1.2379 1.4961 1.7670 1.3571 1.2830 1.2964 3.9262 1.2635 1.3444 3.4401 2.2376 2.1326 1.0868 1.0633 1.0640 1.0544 1.0585 1.0519 1.0486 2.5384 1.0674 1.0667 2.2472 1.0756 1.0759 6.7355 6.0804 6.1224 6.1819 1.0715 1.0709 1.0835 1.0587 1.0351 1.0645 1.0387 1.0383 1.0591 1.0841 1.0851 1.0859 1.0978 1.1010 1.0990 1.0989 1.0989 1.0985 1.1006 1.1004 1.1001 1.0863 1.0868 1.0866 1.0916 1.0954 1.0907 1.1013 1.0947 1.0989
irintensity: 0.0586 0.0579 0.0962 0.1056 0.7194 0.2280 0.3079 0.0335 0.7626 0.3595 0.5852 0.4574 0.0120 0.2478 1.0848 1.1565 1.2691 0.4281 0.9949 0.1090 1.1009 1.2323 0.4087 0.7314 0.1239 1.7302 2.6027 1.4961 1.5093 0.5442 8.0722 1.8092 0.5275 0.1685 6.4961 0.3774 0.2536 8.2683 2.2340 1.4798 6.5813 10.6016 5.4958 2.2311 21.5447 11.1132 4.2897 7.1008 48.7698 21.3258 14.5702 1.6548 4.4909 27.0121 6.0915 87.2225 6.2090 24.4190 2.7791 5.9478 0.1881 9.2677 8.0442 5.9037 6.7559 21.8113 124.0607 126.1526 24.1401 6.1136 1.3403 119.3582 16.7054 69.8070 1.9585 5.5656 63.4584 128.2406 3.7344 21.8253 7.9474 5.0975 1.4123 40.0647 12.7769 44.4335 14.0877 51.1126 9.8652 27.7757 2.1636 2.6482 1.3368 4.6051 2.1287 23.0670 7.2864 21.5688 48.1327 17.2871 106.4629 22.3919 48.8474 21.1685 19.4912 1.3333 30.2676 12.8377 1.6126 14.5406 3.7055 7.0382 9.8736 12.4035 18.9973 2.6345 26.4486 12.3613 4.7136 13.1326 13.1370 3.7443 6.5762 8.2154 4.6992 8.6000 8.7971 5.0827 16.7563 10.1976 5.9159 10.1370 16.1408 2.0546 6.8120 1.4835 11.1092 4.6098 28.7850 171.6761 32.2097 15.4361 30.0876 19.6938 43.0357 23.7209 41.0918 9.0366 23.4450 23.9116 21.1655 16.9973 4.6714 52.4309 36.0766 110.7889 48.5397 44.9055 24.9606 6.1979 0.2637 4.2916 20.1759 35.7600 6.5718 22.8427 4.8553 14.2390
temp: 298.150 k
press: 1.00000 atm
elementType: 9 9 9 8 7 6 6 6 6 6 6 6 6 6 6 6 6 6 6 6 6 6 6 6 6 6 6 6 1 1 1 1 1 1 1 1 1 1 1 1 1 1 1 1 1 1 1 1 1 1 1 1 1 1 1 1 1 1
symmnumber: 1
zpe: 1257689.3 jmol-1
zpe.correction: 0.479029 hartree
zpe.thermalcorrener: 0.508473 hartree
zpe.thermalcorrenthalpy: 0.509417 hartree
zpe.thermalcorrgfe: 0.413291 hartree
zpe.sumelectzpe: -1321.804244 hartree
zpe.sumelectthermal: -1321.774800 hartree
zpe.sumelectthermalent: -1321.773856 hartree
zpe.sumelectthermalfe: -1321.869982 hartree
dipole: 1.0148 -2.0209 2.0291
dipole: 3.0383
quadrupole: -164.1028 -160.6450 -159.8185
quadrupole: 5.7296 -15.0269 -2.3670
quadrupole: -2.5806 0.8771 1.7036 5.7296 -15.0269 -2.3670
hfenergy: -1322.283273 hartree
pointgroup: C01 [X(C23H30F3N1O1)]
dipole: -0.3638535 -0.836636 -0.772368 debye
polarizability: 279.8874815|-29.198998|253.6925988|-12.286401|11.09031|237.5632835 unknown
InChI: InChI=1S/C23H30F3NO/c1-4-27(5-2)17-11-12-18(3)28-22(19-13-7-6-8-14-19)20-15-9-10-16-21(20)23(24,25)26/h6-10,13-16,18,22H,4-5,11-12,17H2,1-3H3
charge 0 multiplicity 1
58 atoms
F  5.336847 0.220149 1.836786
F  3.490016 1.494693 1.561413
F  3.319104 -0.551903 2.518204
O  0.007122 -0.74153 -0.166335
N  -5.304827 -0.291534 -0.033542
C  -1.887731 -2.081359 0.466647
C  -0.478586 -1.650515 0.9096
C  -2.909701 -0.923861 0.456768
C  -4.276023 -1.358833 -0.119091
C  1.20267 0.06474 0.187665
C  0.472328 -2.841094 1.132094
C  -6.266353 -0.285606 -1.163628
C  -5.914789 -0.187803 1.31427
C  2.452118 -0.554424 -0.454656
C  0.922866 1.500449 -0.268984
C  3.75602 -0.470131 0.115943
C  -7.24975 -1.488214 -1.249637
C  -6.700544 1.118959 1.533833
C  2.313102 -1.231887 -1.690763
C  1.149102 1.930044 -1.599333
C  0.361217 2.413016 0.658652
C  4.87539 -1.031678 -0.546068
C  3.976759 0.164502 1.461588
C  3.426692 -1.788187 -2.354251
C  4.715496 -1.6830 -1.785118
C  0.811059 3.243339 -1.995593
C  0.024506 3.726207 0.266912
C  0.247784 4.145869 -1.065172
H  -2.234801 -2.889226 1.142765
H  -1.806053 -2.524095 -0.547045
H  -0.554456 -1.05683 1.849809
H  -2.515481 -0.084592 -0.142669
H  -3.040796 -0.544343 1.490646
H  -4.13707 -1.615755 -1.187765
H  -4.607875 -2.301227 0.389785
H  1.307452 0.071958 1.290754
H  0.566618 -3.440574 0.20879
H  0.079304 -3.493703 1.934225
H  1.481183 -2.509833 1.435601
H  -5.673235 -0.236269 -2.097105
H  -6.847572 0.654163 -1.120046
H  -5.089724 -0.224922 2.050021
H  -6.576717 -1.062498 1.545799
H  -6.705746 -2.447688 -1.326883
H  -7.910549 -1.540054 -0.364904
H  -7.89327 -1.390569 -2.14417
H  -6.063364 1.98911 1.296043
H  -7.607498 1.172614 0.904829
H  -7.024147 1.195814 2.588403
H  1.304397 -1.334302 -2.1014
H  1.594949 1.245224 -2.32804
H  0.191011 2.093689 1.694294
H  5.864997 -0.959648 -0.086408
H  3.288904 -2.3049 -3.310413
H  5.585596 -2.111663 -2.292649
H  0.991499 3.563714 -3.028047
H  -0.406051 4.420925 0.996666
H  -0.009799 5.165772 -1.372285
