program: Gaussian 09
title: 000201085
version: EM64L-G09RevD.01
frameworkgroup: C1[X(C23H27F3NO)]
method: RPBEPBE
basis: SDD
operation: Freq
keyword: #p
keyword: freq=noraman
keyword: PBEPBE/SDD
title: #p freq=noraman PBEPBE/SDD
converged: YES YES NO NO
title: Mulliken charges:
elementType: F F F O N C C C C C C C C C C C C C C C C C C C C C C C H H H H H H H H H H H H H H H H H H H H H H H H H H H
charge: -0.139441 -0.167183 -0.188410 -0.287324 -0.100170 -0.068159 -0.084335 -0.513757 -0.506167 -0.586579 -0.520782 0.035358 -0.568666 -0.586937 -0.364491 0.477378 0.436076 0.066902 -0.347719 -0.417889 -0.401927 -0.343261 0.208517 -0.226639 -0.221992 -0.237184 -0.224932 -0.233965 0.289918 0.285666 0.270940 0.279810 0.279177 0.262663 0.290213 0.261152 0.255409 0.272224 0.229785 0.285107 0.263302 0.263061 0.289198 0.263038 0.261896 0.229660 0.267300 0.249562 0.262525 0.275006 0.248284 0.241969 0.237594 0.254528 0.244693
chargesum: 1.00000
title: Mulliken charges with hydrogens summed into heavy atoms:
elementType: F F F O N C C C C C C C C C C C C C C C C C C C C C C C
charge: -0.139441 -0.167183 -0.188410 -0.287324 -0.100170 0.221758 0.201331 0.036992 0.035673 -0.035214 0.006850 0.265143 0.242805 0.227194 -0.134831 0.477378 0.436076 0.066902 -0.080420 -0.168327 -0.139401 -0.068255 0.208517 0.021645 0.019978 0.000410 0.029596 0.010728
polarizability: 2.57064886e+02 7.59657085e+00 2.66721986e+02 -1.08621167e+01 1.20113858e+00 2.11554287e+02
1716.lowfreq: -8.6318 -4.3201 -0.0009 -0.0007 0.0003 9.7726 16.6498 24.9305 29.9527
frequency: 16.3462 24.4053 29.4581 43.5108 46.2099 61.4571 63.0409 92.8192 111.7228 127.0561 132.0173 159.7053 177.6196 199.0369 218.1831 231.6088 234.3960 250.9069 262.2049 288.9365 305.2005 322.9164 331.1356 369.0596 384.4288 387.5218 393.5510 404.9184 411.9648 430.2349 432.4623 447.4569 479.4365 492.7171 508.6993 519.7247 534.6577 560.0573 569.0824 602.4204 606.6793 615.0565 626.7360 658.0313 663.7228 702.3078 715.0679 740.1907 757.1731 768.6229 779.2569 806.7846 812.2104 839.1287 856.5279 862.6637 866.9212 877.1663 878.3844 891.9690 906.6252 914.0111 925.9468 934.5153 939.3961 976.5477 981.1963 982.5973 988.4017 989.4562 993.0737 1006.0758 1010.8958 1011.2894 1021.6509 1023.7767 1027.0782 1028.8569 1043.2949 1058.7116 1082.2266 1086.4762 1092.6491 1115.2370 1120.4727 1157.0865 1159.5198 1164.5038 1176.0378 1184.5384 1185.9994 1188.2625 1191.2063 1201.2890 1217.9801 1226.9939 1229.4703 1254.0772 1265.2098 1278.3681 1280.0967 1286.7367 1293.9658 1305.9591 1317.8100 1319.4782 1323.3046 1326.9355 1340.3704 1347.2897 1351.3563 1377.4466 1389.7920 1394.7080 1417.1479 1439.7724 1445.1801 1448.4971 1455.5429 1457.3577 1475.3788 1478.0062 1481.2188 1483.3905 1491.6990 1496.8843 1510.8190 1517.7042 1587.1580 1592.7611 1611.1483 1612.0912 2985.6909 3017.6340 3019.9177 3027.8435 3030.8205 3033.9302 3035.0768 3042.5007 3054.6144 3063.5709 3075.4167 3083.1543 3090.6206 3108.7235 3121.5066 3127.7648 3130.0232 3136.3433 3142.8855 3146.6998 3152.8683 3160.7385 3170.2979 3170.9438 3172.0456 3183.7295 3187.2866
redmass: 5.1775 4.7361 4.6390 4.0832 4.6141 9.6901 4.9245 5.0529 4.9347 2.5210 1.5416 7.1745 3.8030 2.2339 1.6678 2.6276 4.5109 4.9003 5.8443 2.1642 3.6923 5.4137 6.7184 3.7926 2.0116 6.9487 3.6242 2.8690 2.2498 3.8977 3.5892 3.3391 3.9957 3.3459 3.7187 9.1659 2.8214 4.9870 3.8394 6.0538 10.4508 6.4051 3.8119 5.1483 3.8929 5.0255 1.9479 3.4112 3.0143 2.2099 1.3094 1.6751 2.6698 3.6579 3.6945 2.0176 1.4943 1.7505 2.1161 2.3544 2.4776 3.0803 3.9991 3.9867 1.5427 3.1449 2.0639 2.1142 1.5709 3.8740 2.2887 1.3357 1.7194 1.4460 3.6577 3.1708 1.9731 2.2907 2.1230 2.3634 1.6093 1.3028 1.9989 2.5233 1.2306 1.6825 1.7999 1.3525 1.0734 1.3458 1.3477 1.1022 1.6351 1.4238 2.3428 1.5531 1.2197 1.5648 2.4418 1.8328 2.0961 1.3209 1.4345 1.5300 1.3255 1.3478 1.3885 1.4895 1.4338 1.3994 1.4074 3.3084 2.3404 2.4294 1.1332 2.1658 2.0788 1.1608 1.0601 1.0555 1.0633 1.0576 2.2586 2.5123 1.0736 1.0648 1.0816 1.0579 6.5719 5.9535 5.9891 6.1332 1.0837 1.0838 1.0629 1.0612 1.0361 1.0364 1.0636 1.0665 1.0852 1.0876 1.1009 1.1017 1.1037 1.1040 1.0890 1.0864 1.1045 1.1043 1.0908 1.0869 1.0957 1.0904 1.1010 1.0954 1.1016 1.0996 1.0999
irintensity: 3.1904 1.1729 1.1455 0.5198 0.7729 0.0707 0.4133 3.9084 0.5307 0.6584 0.5970 1.5456 2.5665 0.3166 0.0583 1.1278 0.9791 3.3956 0.8799 0.2386 2.0358 0.2288 6.0790 4.0352 0.1955 5.4520 3.1149 0.3454 0.4307 2.1209 0.0566 1.3320 5.5551 3.5844 0.2399 2.6662 1.5242 2.9173 1.9172 20.5007 8.3048 0.1158 5.3568 5.0046 3.1522 5.7418 48.3797 4.4085 28.0154 32.4994 100.9643 9.5004 1.7397 7.5832 7.6615 15.8936 5.9399 1.6006 2.2250 29.5306 8.3529 9.5396 124.1348 114.6404 14.1336 76.2945 41.2133 2.1990 2.6757 8.0873 48.5562 1.0804 0.0821 0.1496 172.0352 144.3051 11.5526 37.6396 56.1201 15.3597 9.8353 2.4135 1.6606 39.7598 7.7098 2.3828 3.0628 1.4888 0.7610 3.2471 0.3615 0.7595 2.6969 1.2270 27.5511 0.8962 2.5446 30.6384 123.8063 2.2648 118.8930 7.5591 0.9579 18.3305 6.5729 13.2715 5.1533 6.3572 1.5583 8.2374 3.9915 11.1461 7.2226 2.1986 7.4624 14.6758 9.8968 30.7820 9.5147 6.0043 56.4404 22.8081 4.7114 22.2304 36.3606 5.4914 25.9870 3.4290 7.4191 0.9678 2.1632 9.7037 16.8136 7.2676 4.5879 3.4154 2.7442 9.4708 4.0938 13.8610 20.2326 19.0532 6.8397 10.3424 0.1361 23.7265 4.8848 2.7821 0.7501 5.4492 4.3908 1.5545 21.0942 3.0558 15.1961 6.0435 3.9571 8.4513 2.3296
temp: 298.150 k
press: 1.00000 atm
elementType: 9 9 9 8 7 6 6 6 6 6 6 6 6 6 6 6 6 6 6 6 6 6 6 6 6 6 6 6 1 1 1 1 1 1 1 1 1 1 1 1 1 1 1 1 1 1 1 1 1 1 1 1 1 1 1
symmnumber: 1
zpe: 1194193.4 jmol-1
zpe.correction: 0.454844 hartree
zpe.thermalcorrener: 0.480006 hartree
zpe.thermalcorrenthalpy: 0.480950 hartree
zpe.thermalcorrgfe: 0.398435 hartree
zpe.sumelectzpe: -1319.836142 hartree
zpe.sumelectthermal: -1319.810981 hartree
zpe.sumelectthermalent: -1319.810037 hartree
zpe.sumelectthermalfe: -1319.892551 hartree
dipole: 14.3157 1.5021 3.1721
dipole: 14.7396
quadrupole: -59.8253 -143.6080 -147.3337
quadrupole: -4.6268 0.6046 -3.9876
quadrupole: 57.0970 -26.6857 -30.4114 -4.6268 0.6046 -3.9876
hfenergy: -1320.2909864 hartree
pointgroup: C01 [X(C23H27F3N1O1)]
dipole: -5.5825079 -1.0307343 1.1839644 debye
polarizability: 255.9730357|6.3870513|267.6640479|11.3710886|1.9257354|211.7040749 unknown
InChI: InChI=1S/C23H27F3NO/c1-27(2)17-12-13-18(27)15-19(14-17)28-22(16-8-4-3-5-9-16)20-10-6-7-11-21(20)23(24,25)26/h3-11,17-19,22H,12-15H2,1-2H3
charge 1 multiplicity 1
55 atoms
F  2.229196 3.941545 -0.942699
F  1.813349 2.041784 -2.097415
F  0.360866 2.74483 -0.506173
O  -0.153199 -0.016652 0.745498
N  -4.353812 -0.085767 0.671093
C  -3.680099 1.332623 0.628529
C  -3.685301 -0.731512 -0.595274
C  -3.85771 1.734636 -0.863415
C  -3.872665 0.384271 -1.661953
C  -2.195496 1.206499 1.020065
C  -2.19766 -1.018733 -0.299679
C  -1.411798 0.278163 0.059428
C  -5.864307 0.030903 0.484205
C  -4.13117 -0.849985 1.965892
C  1.024357 -0.244774 -0.154249
C  2.20375 0.468889 0.519093
C  1.24423 -1.733049 -0.416577
C  2.523136 1.833967 0.240548
C  2.9825 -0.210358 1.483638
C  1.845537 -2.136904 -1.635116
C  0.881056 -2.717927 0.53568
C  3.580913 2.48192 0.921633
C  1.770493 2.625414 -0.791558
C  4.033458 0.436676 2.169274
C  2.085251 -3.504494 -1.896304
C  1.1177 -4.08618 0.273542
C  4.333492 1.786799 1.890183
C  1.721719 -4.483339 -0.942323
H  -4.229936 1.982512 1.330745
H  -4.237598 -1.659255 -0.825184
H  -3.022702 2.383832 -1.170931
H  -4.783297 2.310947 -1.024133
H  -4.811835 0.255788 -2.224446
H  -3.055099 0.334519 -2.398369
H  -1.744511 2.213603 0.984045
H  -2.066629 0.857214 2.059535
H  -2.077017 -1.765851 0.503529
H  -1.763251 -1.484062 -1.203143
H  -1.195634 0.835394 -0.874159
H  -6.098559 0.591915 -0.428039
H  -6.292351 -0.981248 0.41393
H  -6.288417 0.553727 1.355618
H  -3.064543 -0.988637 2.166246
H  -4.586646 -0.280699 2.791533
H  -4.619238 -1.83397 1.8824
H  0.81051 0.24523 -1.123209
H  2.771513 -1.263635 1.68872
H  2.136668 -1.382468 -2.376882
H  0.412525 -2.403517 1.475196
H  3.817596 3.523657 0.689222
H  4.620567 -0.113903 2.911432
H  2.553595 -3.805752 -2.839353
H  0.840127 -4.84075 1.017893
H  5.151333 2.293938 2.411023
H  1.909343 -5.543373 -1.143685
