program: Gaussian 09
title: 000201026
version: EM64L-G09RevD.01
frameworkgroup: C1[X(C13H25NO)]
method: RPBEPBE
basis: SDD
operation: Freq
keyword: #p
keyword: freq=noraman
keyword: PBEPBE/SDD
title: #p freq=noraman PBEPBE/SDD
converged: YES YES NO NO
title: Mulliken charges:
elementType: O N C C C C C C C C C C C C C H H H H H H H H H H H H H H H H H H H H H H H H H
charge: -0.291110 -0.125764 -0.131695 -0.392782 -0.399080 -0.377911 -0.373119 -0.401897 0.190104 -0.399726 -0.406422 -0.356276 -0.363760 -0.694218 -0.702374 0.183515 0.203228 0.268468 0.225215 0.212949 0.202648 0.212252 0.201993 0.201018 0.222023 0.190854 0.217865 0.197119 0.226542 0.183688 0.186519 0.208694 0.177665 0.230646 0.217062 0.215432 0.206271 0.202475 0.213191 0.218699
chargesum: 0.00000
title: Mulliken charges with hydrogens summed into heavy atoms:
elementType: O N C C C C C C C C C C C C C
charge: -0.291110 -0.125764 0.051820 0.078914 0.039083 0.036989 0.029892 0.010980 0.190104 0.015258 0.003808 0.038937 0.044551 -0.055453 -0.068010
polarizability: 1.73549867e+02 -1.55779660e+00 1.49086065e+02 -5.30502668e+00 4.50668073e+00 1.25524461e+02
1716.lowfreq: -11.5560 -4.4559 -0.0007 -0.0006 -0.0003 15.4355 24.1461 43.3321 49.9423
frequency: 23.4970 42.3158 49.9124 62.1522 69.8537 73.0709 81.0262 140.8888 158.6545 190.5839 225.8747 230.9277 236.7424 255.1889 271.0134 293.8488 309.7644 355.0022 388.1703 409.8029 431.0904 468.8533 500.7813 541.3331 607.3752 690.0135 707.5067 736.1146 763.5471 802.7918 824.4761 841.1580 848.4405 877.4696 890.5427 901.2597 905.0060 930.5101 949.0393 980.5407 1008.3286 1036.3174 1043.0019 1050.6973 1069.7929 1078.1527 1088.1056 1105.8824 1115.5863 1124.7998 1129.7797 1152.6891 1160.2293 1211.4984 1223.2187 1232.2167 1241.6261 1256.0106 1264.4213 1272.7266 1282.8894 1293.4226 1301.1773 1306.8444 1323.0751 1333.4214 1337.2511 1343.0828 1345.6331 1351.8994 1352.7869 1361.2584 1386.3305 1389.5567 1413.6524 1446.8948 1454.8156 1461.5645 1462.9269 1466.9378 1470.7834 1471.2435 1474.6471 1476.6939 1477.3591 1479.3634 1483.7849 1486.9731 1568.3096 2944.5570 2953.4969 2962.2614 2963.9836 2967.0818 2969.0329 2970.3005 2973.0589 2974.4787 2979.9224 2984.5101 2987.5429 3011.2389 3023.1627 3035.8823 3036.8260 3043.3743 3051.7842 3053.8597 3067.9351 3070.5381 3072.2932 3073.3140 3087.0441 3099.0664
redmass: 2.8919 2.6470 2.6954 2.4197 2.2503 3.8175 2.0627 4.2421 2.7445 2.3109 1.2664 1.4389 1.4321 2.1252 2.7960 3.1308 2.7338 4.0166 1.9160 2.9782 2.8788 3.2301 2.1527 2.8205 2.6997 4.3028 1.9315 1.1161 1.5616 1.5276 2.6106 1.4167 1.4400 1.7788 2.0765 1.8981 1.5852 2.5070 1.3327 2.3574 2.4474 2.7036 2.0133 1.6464 2.4840 1.8622 1.4437 1.9207 2.2981 2.0770 2.1707 1.3131 2.2100 1.5644 1.4235 1.9078 1.8145 1.2716 1.2287 1.2004 1.2670 1.1508 1.1418 1.3415 1.2999 1.3857 1.3487 1.5371 1.4835 1.4372 1.5100 1.3299 1.2131 1.2123 2.4804 1.0944 1.0908 1.0849 1.0870 1.0907 1.0687 1.0688 1.0717 1.0434 1.0431 1.0989 1.0686 1.0786 7.0268 1.0713 1.0697 1.0621 1.0596 1.0637 1.0621 1.0398 1.0364 1.0785 1.0612 1.0620 1.0611 1.0956 1.0939 1.0964 1.1017 1.1024 1.1014 1.1031 1.0999 1.1004 1.1007 1.0996 1.0929 1.0902
irintensity: 1.1790 0.1257 0.2421 0.3650 0.1164 1.1295 0.3246 2.0513 0.7774 0.0351 0.4932 0.4140 0.2685 2.0673 0.5369 1.7006 0.8185 12.3270 1.8221 3.6470 0.7082 1.2832 0.4446 10.8904 1.5342 1.2318 5.8840 11.1291 6.9698 0.1326 1.2403 0.4092 17.8047 1.8446 0.9275 8.7781 5.7769 3.9362 6.9032 2.8330 40.9203 1.0263 1.0958 6.7989 2.9337 0.8525 2.3563 15.1633 36.9862 6.1168 14.6737 2.5107 3.5062 67.2602 17.7627 2.7438 61.1750 7.4904 0.8631 10.0212 10.2596 1.4460 2.4380 2.4720 1.4052 0.0578 2.9515 10.2234 0.2069 6.6741 4.7011 6.6641 8.5492 12.3757 91.6933 27.1637 7.4934 14.8708 5.5051 15.3024 4.7262 2.7432 9.5619 12.9503 12.3295 5.9967 12.1332 11.5334 226.0767 34.0631 59.3737 20.5286 19.1696 44.2370 54.2974 18.1969 35.8860 45.7642 28.3049 44.4499 32.4358 3.1857 4.3152 80.0378 22.6089 39.4416 5.6449 85.5389 61.2041 88.8696 50.1387 67.5510 7.7490 23.2468
temp: 298.150 k
press: 1.00000 atm
elementType: 8 7 6 6 6 6 6 6 6 6 6 6 6 6 6 1 1 1 1 1 1 1 1 1 1 1 1 1 1 1 1 1 1 1 1 1 1 1 1 1
symmnumber: 1
zpe: 945602.2 jmol-1
zpe.correction: 0.360161 hartree
zpe.thermalcorrener: 0.377703 hartree
zpe.thermalcorrenthalpy: 0.378647 hartree
zpe.thermalcorrgfe: 0.313251 hartree
zpe.sumelectzpe: -639.144339 hartree
zpe.sumelectthermal: -639.126797 hartree
zpe.sumelectthermalent: -639.125852 hartree
zpe.sumelectthermalfe: -639.191248 hartree
dipole: -2.2098 2.2398 2.6891
dipole: 4.1390
quadrupole: -88.3005 -97.4291 -97.2955
quadrupole: 3.2811 -0.1728 -3.6347
quadrupole: 6.0412 -3.0874 -2.9538 3.2811 -0.1728 -3.6347
hfenergy: -639.5044997 hartree
pointgroup: C01 [X(C13H25N1O1)]
dipole: -0.8000914 -0.9369722 -1.0647153 debye
polarizability: 173.1895368|3.6740451|149.3808931|4.3991223|5.3176315|125.5899643 unknown
InChI: InChI=1S/C13H25NO/c1-3-8-12(9-4-2)13(15)14-10-6-5-7-11-14/h12H,3-11H2,1-2H3
charge 0 multiplicity 1
40 atoms
O  0.160577 1.537784 1.41634
N  -1.284924 0.623292 -0.153598
C  1.156582 -0.046149 -0.175441
C  -2.421648 1.389629 0.412192
C  -1.651433 -0.258725 -1.281626
C  -3.56097 0.446931 0.85734
C  -2.785395 -1.236201 -0.881128
C  -4.00151 -0.471715 -0.306819
C  -0.017242 0.771321 0.412953
C  1.13145 -1.480785 0.445156
C  2.494309 0.685115 0.09512
C  2.056182 -2.497368 -0.26381
C  2.661277 1.99712 -0.705148
C  1.975437 -3.903391 0.370256
C  4.021483 2.677473 -0.440625
H  1.037161 -0.140296 -1.274576
H  -2.798967 2.09015 -0.363649
H  -2.026451 1.980239 1.253866
H  -0.771383 -0.820914 -1.626248
H  -1.999963 0.369992 -2.13013
H  -4.413702 1.052674 1.219177
H  -3.207837 -0.167812 1.708194
H  -2.399701 -1.943275 -0.119759
H  -3.079741 -1.83125 -1.767286
H  -4.778643 -1.183315 0.029935
H  -4.457262 0.146706 -1.108511
H  1.411838 -1.402528 1.514815
H  0.095659 -1.87838 0.425541
H  2.552179 0.911999 1.176441
H  3.333432 0.004699 -0.150977
H  1.779371 -2.55723 -1.337046
H  3.104414 -2.142903 -0.231626
H  2.55752 1.785655 -1.790362
H  1.844054 2.691374 -0.430999
H  2.637338 -4.620081 -0.149615
H  2.277551 -3.874349 1.43399
H  0.943925 -4.301871 0.32668
H  4.86179 2.013218 -0.720002
H  4.124743 3.614966 -1.017694
H  4.1318 2.926297 0.63138
