program: Gaussian 09
title: 000201025
version: EM64L-G09RevD.01
frameworkgroup: C1[X(C14H29NO)]
method: RPBEPBE
basis: SDD
operation: Freq
keyword: #p
keyword: freq=noraman
keyword: PBEPBE/SDD
title: #p freq=noraman PBEPBE/SDD
converged: YES YES NO NO
title: Mulliken charges:
elementType: O N C C C C C C C C C C C C C C H H H H H H H H H H H H H H H H H H H H H H H H H H H H H
charge: -0.295241 -0.133722 -0.135825 -0.396720 -0.426245 0.183225 -0.373196 -0.368629 -0.387574 -0.354617 -0.345214 -0.349518 -0.700405 -0.700950 -0.676825 -0.684153 0.203863 0.201313 0.186420 0.184732 0.239138 0.240155 0.212470 0.175608 0.225983 0.225224 0.211728 0.251656 0.193025 0.205400 0.210982 0.187136 0.236031 0.205346 0.204937 0.218761 0.204352 0.218268 0.213138 0.225107 0.211104 0.209766 0.220152 0.220181 0.203634
chargesum: 0.00000
title: Mulliken charges with hydrogens summed into heavy atoms:
elementType: O N C C C C C C C C C C C C C C
charge: -0.295241 -0.133722 0.068038 -0.008986 -0.002374 0.183225 0.079429 0.032962 0.049377 0.090064 0.071169 0.073649 -0.071361 -0.065193 -0.030849 -0.040186
polarizability: 1.77882915e+02 -2.17995561e+00 1.62833348e+02 2.52964614e+00 -3.28027739e+00 1.49464097e+02
1716.lowfreq: -0.0005 -0.0004 0.0003 1.1024 10.3635 12.0452 32.8427 35.0386 45.0414
frequency: 32.6920 34.7610 44.9885 55.6028 63.4646 70.8397 79.3564 93.5988 93.9341 98.8258 100.9762 128.7816 207.3060 220.9246 222.6894 225.5698 231.7943 239.2916 242.2548 263.5278 273.4433 300.4318 313.6561 318.9608 366.1214 417.6734 455.8817 520.3540 579.7583 620.9035 712.8731 728.8554 741.7095 742.7981 747.8237 769.9250 843.9650 855.8265 860.3575 865.9205 884.9177 888.1031 899.8370 906.9610 951.4885 998.0741 1031.3670 1046.3116 1051.5770 1052.6664 1060.5668 1079.6420 1090.2997 1104.1789 1106.0772 1111.6521 1127.4865 1133.3456 1164.9390 1206.0137 1216.6831 1227.3224 1235.3558 1243.9330 1261.9651 1283.9959 1286.4725 1291.3588 1296.8508 1297.5820 1303.3965 1307.5241 1318.5689 1345.9835 1352.6225 1353.2548 1362.4265 1365.3733 1387.3936 1389.6986 1391.6146 1394.0328 1411.7465 1446.7437 1451.9893 1461.1248 1469.6505 1472.1502 1472.6787 1475.8638 1476.7161 1478.9550 1479.3807 1479.5771 1480.9888 1483.8979 1485.7586 1488.4172 1493.3052 1569.8675 2950.9270 2957.6267 2968.2815 2970.7110 2972.4600 2975.0143 2975.4246 2979.9985 2982.0656 2984.3620 2989.8992 2994.2645 2994.7471 3002.0992 3016.8999 3028.3861 3038.6455 3040.9666 3054.2718 3057.8736 3065.9377 3068.3455 3069.7603 3070.7707 3072.7305 3073.4348 3077.3802 3079.8076 3080.4360
redmass: 3.4297 3.7688 3.3194 3.2639 2.0006 2.3549 1.8224 1.9284 2.3784 1.8439 2.5347 3.7049 2.0637 1.5529 1.5485 1.2125 1.2348 1.3941 2.3646 2.4685 2.5126 3.0797 2.8661 2.9431 3.3478 2.8849 3.7202 3.8883 3.2955 3.4276 2.4028 1.6810 1.1054 1.1989 1.2011 1.9043 2.0829 1.3356 1.5053 1.2428 1.5612 1.6133 1.6408 1.5298 2.6694 2.3779 2.0962 2.9206 2.7058 1.9854 2.0767 2.1436 1.6878 2.1505 1.6452 2.2328 2.4312 2.0529 2.2764 2.5283 1.5268 1.3815 1.3694 1.2874 1.4104 1.2609 1.1887 1.1459 1.3136 1.2377 1.1799 1.2512 1.3453 1.3287 1.5198 1.4270 1.4157 1.3958 1.2140 1.2164 1.2100 1.2105 2.3378 1.1309 1.0819 1.0896 1.0693 1.0735 1.0608 1.0486 1.0450 1.0435 1.0470 1.0436 1.0767 1.0667 1.0708 1.0869 1.1000 5.9211 1.0593 1.0621 1.0361 1.0553 1.0458 1.0366 1.0364 1.0615 1.0633 1.0790 1.0640 1.0636 1.0636 1.0977 1.0939 1.0982 1.0954 1.1005 1.0989 1.0995 1.0996 1.0999 1.0998 1.1010 1.1005 1.1013 1.0998 1.0991 1.1022
irintensity: 0.4820 0.6150 0.2904 0.2393 0.2076 0.2735 0.3312 0.9567 0.0882 0.6260 0.4582 3.5280 0.9917 0.2640 0.2872 0.2604 0.0050 0.9153 0.1170 0.3215 0.1938 0.7185 1.0075 1.2564 14.0575 6.3517 4.4196 2.3454 3.3362 1.2713 2.6784 16.1786 3.1891 2.9445 16.8712 5.0379 0.6116 0.7612 0.3211 1.3108 17.2431 12.3751 3.3187 2.6914 1.0204 3.8406 3.0626 0.5447 0.3008 0.3245 3.3700 8.2680 23.5519 6.0173 15.0975 3.6411 33.7597 40.5893 9.7653 20.3148 26.1962 10.0496 3.2103 2.9449 11.4563 2.0830 12.0070 1.0413 3.4666 5.1704 2.5253 7.7042 4.8876 1.8321 5.9646 4.6041 2.4406 2.6768 10.8862 11.2184 13.1303 14.4052 82.7345 18.7230 11.7669 10.1449 3.2684 4.7746 3.5402 3.2181 10.8514 11.6878 12.2398 10.3980 5.1454 13.0426 17.6152 11.2952 13.2945 211.9111 23.1658 32.9408 55.2968 16.8198 67.6211 49.3072 24.7237 10.3017 4.0442 29.5864 68.1112 11.2612 60.8801 32.3556 11.5448 4.3325 3.9895 1.4331 6.0478 4.1566 14.4710 51.4460 56.8720 82.8705 47.5253 108.9551 46.3581 38.2174 62.2675
temp: 298.150 k
press: 1.00000 atm
elementType: 8 7 6 6 6 6 6 6 6 6 6 6 6 6 6 6 1 1 1 1 1 1 1 1 1 1 1 1 1 1 1 1 1 1 1 1 1 1 1 1 1 1 1 1 1
symmnumber: 1
zpe: 1069280.1 jmol-1
zpe.correction: 0.407267 hartree
zpe.thermalcorrener: 0.428566 hartree
zpe.thermalcorrenthalpy: 0.429510 hartree
zpe.thermalcorrgfe: 0.355619 hartree
zpe.sumelectzpe: -679.539482 hartree
zpe.sumelectthermal: -679.518184 hartree
zpe.sumelectthermalent: -679.517240 hartree
zpe.sumelectthermalfe: -679.591131 hartree
dipole: 1.8147 -1.8216 2.9200
dipole: 3.8907
quadrupole: -97.4580 -102.4375 -106.6685
quadrupole: -0.8413 -1.6056 0.7396
quadrupole: 4.7300 -0.2495 -4.4805 -0.8413 -1.6056 0.7396
hfenergy: -679.9467496 hartree
pointgroup: C01 [X(C14H29N1O1)]
dipole: -0.7318005 0.6938113 1.1516147 debye
polarizability: 177.9848477|-1.6743536|162.7115815|-2.7593308|3.1956976|149.4839312 unknown
InChI: InChI=1S/C14H29NO/c1-5-9-13(10-6-2)14(16)15(11-7-3)12-8-4/h13H,5-12H2,1-4H3
charge 0 multiplicity 1
45 atoms
O  0.266537 -0.777379 -1.613492
N  -1.193191 0.221658 -0.113296
C  1.269304 0.129591 0.439883
C  1.458156 -1.058344 1.440793
C  2.552151 0.422627 -0.377323
C  0.086539 -0.163791 -0.508682
C  1.864986 -2.406462 0.801055
C  2.50106 1.771069 -1.130146
C  -1.515897 0.942704 1.137815
C  -2.327357 -0.093646 -1.016226
C  -1.515514 2.483877 0.98124
C  -2.98226 -1.458953 -0.701591
C  1.923867 -3.544219 1.842883
C  3.798003 2.060706 -1.915792
C  -1.920942 3.198068 2.288058
C  -4.183844 -1.744043 -1.627607
H  1.045147 1.032728 1.042124
H  2.231929 -0.760494 2.178764
H  0.519563 -1.209697 2.015296
H  3.420712 0.41715 0.313919
H  2.702933 -0.390636 -1.110549
H  1.151983 -2.665091 -0.003904
H  2.853359 -2.302538 0.313952
H  2.314157 2.59372 -0.40758
H  1.642934 1.757559 -1.83044
H  -0.815583 0.647588 1.938647
H  -2.520064 0.611893 1.469127
H  -1.941655 -0.105861 -2.050483
H  -3.077152 0.717332 -0.930955
H  -2.20856 2.765454 0.164565
H  -0.507359 2.814281 0.663335
H  -3.310525 -1.480041 0.357376
H  -2.215227 -2.246553 -0.819989
H  0.936164 -3.700662 2.317554
H  2.64914 -3.315868 2.647596
H  2.228094 -4.4995 1.377079
H  4.673285 2.101252 -1.23964
H  3.98767 1.268011 -2.66343
H  3.740353 3.025331 -2.453094
H  -1.913416 4.295289 2.161055
H  -1.225594 2.950598 3.112376
H  -2.938578 2.903676 2.607729
H  -4.639281 -2.72464 -1.400277
H  -3.871252 -1.756159 -2.688372
H  -4.969868 -0.972785 -1.515854
