program: Gaussian 09
title: 000200991
version: EM64L-G09RevD.01
frameworkgroup: C1[X(C11H16N2)]
method: RPBEPBE
basis: SDD
operation: Freq
keyword: #pfreq=noraman
keyword: PBEPBE/SDD
title: #p freq=noraman PBEPBE/SDD
converged: YES YES NO NO
title: Mulliken charges:
elementType: N N C C C C C C C C C C C H H H H H H H H H H H H H H H H
charge: -0.180235 -0.063514 -0.370354 -0.383076 -0.368035 -0.382785 0.467878 -0.615712 -0.380365 -0.376993 -0.226252 -0.234600 -0.269411 0.204618 0.216671 0.210839 0.213814 0.209436 0.187063 0.186878 0.211069 0.188606 0.224348 0.224159 0.215485 0.230723 0.217841 0.217266 0.224637
chargesum: 0.00000
title: Mulliken charges with hydrogens summed into heavy atoms:
elementType: N N C C C C C C C C C C C
charge: -0.180235 -0.063514 0.050935 0.041577 0.028464 0.015162 0.467878 0.021402 -0.164880 -0.146270 -0.008411 -0.017333 -0.044775
polarizability: 1.92961312e+02 -1.42551112e-01 1.27295093e+02 2.66621005e+00 4.25424812e+00 7.86923501e+01
1716.lowfreq: -22.9394 -14.0009 -1.3806 0.0001 0.0004 0.0007 39.9460 51.3910 122.6587
frequency: 39.8187 51.2276 122.6565 159.1380 213.8057 227.3445 253.0200 277.2541 296.8525 335.1470 386.4713 408.2608 433.5990 478.0903 504.3869 516.0023 613.6215 620.8264 690.0479 717.6192 755.3607 758.0400 813.3494 844.2866 871.7708 917.2198 935.3309 955.3692 975.1991 977.3713 1007.0298 1031.0941 1047.9399 1062.3385 1069.7207 1077.8614 1088.6486 1127.0274 1148.5509 1161.2210 1170.5231 1199.0855 1202.4967 1228.8024 1239.1492 1289.0050 1297.0546 1325.3835 1342.6828 1353.9874 1359.0825 1372.5648 1377.6854 1385.1690 1430.8092 1445.4625 1453.4862 1456.1360 1460.4793 1464.8154 1474.9948 1481.4193 1494.5930 1578.1921 1617.9437 2842.4464 2847.5404 2866.0928 2910.9815 2922.1925 3020.2723 3028.0396 3032.7342 3057.3785 3078.2465 3091.1245 3120.4696 3126.8862 3148.5796 3157.5070 3168.7621
redmass: 3.6570 3.1627 3.6044 3.1599 1.3233 2.5450 1.6664 4.0178 2.7275 2.4344 1.9198 2.8940 3.5978 2.6875 4.2944 2.7952 6.1079 2.5485 1.7890 3.8350 2.2057 2.6364 1.2794 1.5614 1.4996 3.7450 2.0739 1.3784 1.2992 5.2501 2.4868 2.1584 1.6825 2.1418 1.7108 1.8015 1.6005 1.5628 2.6518 3.1496 1.0520 1.1375 1.1042 2.6090 1.5091 1.5589 1.4244 1.3903 1.3577 1.4086 1.7823 1.6695 1.5008 3.1715 1.1719 2.3950 1.0831 1.1142 1.0804 1.0950 1.1066 1.0543 2.3854 5.9728 6.0892 1.0710 1.0655 1.0604 1.0690 1.0708 1.0731 1.0881 1.0901 1.0906 1.1010 1.0894 1.0843 1.0884 1.0923 1.0941 1.0996
irintensity: 0.1943 1.3558 1.2080 4.1607 0.8757 2.6946 1.8681 2.1828 14.0084 0.4950 2.5977 0.9507 2.4487 0.5406 0.6277 16.1552 0.5116 3.5607 42.7030 4.8104 77.1468 9.5848 0.6676 0.2591 4.7792 31.3717 2.9992 0.1398 0.4027 6.8024 55.5081 9.8409 3.6323 2.9578 9.6173 0.2586 3.2737 13.1174 51.0925 27.4108 0.6521 2.5300 4.5870 12.4819 145.0960 37.3284 21.3317 0.4423 2.3599 2.3310 15.4923 24.2737 14.5592 16.6097 1.8311 1.3437 0.7325 7.6345 60.7048 24.8667 15.0451 9.5423 123.3394 10.1948 156.5382 54.8075 42.5146 214.8418 61.8391 103.0708 45.6076 50.9075 53.8084 25.4052 33.2121 19.9215 9.2173 9.3635 39.4059 41.6164 6.5571
temp: 298.150 k
press: 1.00000 atm
elementType: 7 7 6 6 6 6 6 6 6 6 6 6 6 1 1 1 1 1 1 1 1 1 1 1 1 1 1 1 1
symmnumber: 1
zpe: 657289.2 jmol-1
zpe.correction: 0.250348 hartree
zpe.thermalcorrener: 0.262186 hartree
zpe.thermalcorrenthalpy: 0.263130 hartree
zpe.thermalcorrgfe: 0.212202 hartree
zpe.sumelectzpe: -537.258247 hartree
zpe.sumelectthermal: -537.246410 hartree
zpe.sumelectthermalent: -537.245465 hartree
zpe.sumelectthermalfe: -537.296393 hartree
dipole: 2.0596 -0.0890 -0.3003
dipole: 2.0833
quadrupole: -74.6167 -70.8671 -84.5850
quadrupole: -0.4593 -2.1299 0.3404
quadrupole: 2.0730 5.8225 -7.8954 -0.4593 -2.1299 0.3404
hfenergy: -537.5085953 hartree
pointgroup: C01 [X(C11H16N2)]
dipole: -0.8102337 0.0203878 -0.1220448 debye
polarizability: 192.9473964|-1.0781353|124.519886|-2.7338447|-12.0550235|81.481473 unknown
InChI: InChI=1S/C11H16N2/c1-12-7-9-13(10-8-12)11-5-3-2-4-6-11/h2-6H,7-10H2,1H3
charge 0 multiplicity 1
29 atoms
N  -0.312864 -0.012947 -0.014459
N  -3.200995 -0.000178 0.234197
C  -1.047391 1.213226 0.378889
C  -1.046563 -1.247305 0.326207
C  -2.47399 1.21569 -0.194832
C  -2.480936 -1.205174 -0.232735
C  1.105779 -0.018934 -0.013671
C  -4.615559 0.008844 -0.184462
C  1.844996 1.128632 -0.440111
C  1.852023 -1.1756 0.370527
C  3.25223 1.112041 -0.483238
C  3.26219 -1.182739 0.312427
C  3.980332 -0.043227 -0.111358
H  -0.514357 2.1053 0.016555
H  -1.11127 1.280415 1.48912
H  -1.088656 -1.403385 1.429362
H  -0.531131 -2.111651 -0.126543
H  -3.013479 2.104973 0.181688
H  -2.419258 1.289142 -1.312179
H  -2.430385 -1.241833 -1.35226
H  -3.026007 -2.103533 0.112967
H  -4.748938 0.02502 -1.296211
H  -5.121179 0.897909 0.233179
H  -5.125498 -0.889354 0.207572
H  1.320867 2.030803 -0.770304
H  1.340441 -2.069104 0.739137
H  3.784286 2.008531 -0.823087
H  3.801364 -2.08778 0.616767
H  5.074447 -0.051683 -0.149344
